program: Gaussian 09
title: 000272007
version: EM64L-G09RevD.01
frameworkgroup: C1[X(C20H19ClN2O3)]
method: RPBEPBE
basis: SDD
operation: Freq
keyword: #p
keyword: freq=noraman
keyword: PBEPBE/SDD
title: #p freq=noraman PBEPBE/SDD
converged: YES YES NO NO
title: Mulliken charges:
elementType: Cl O O O N N C C C C C C C C C C C C C C C C C C C C H H H H H H H H H H H H H H H H H H H
charge: -0.054171 -0.227533 -0.195822 -0.196572 -0.089407 -0.361897 0.171135 -0.444118 -0.437366 -0.385608 -0.383212 0.143438 -0.482454 0.221305 0.447938 0.485217 -0.448557 -0.377294 -0.295860 -0.364440 -0.220169 -0.228380 -0.095765 -0.199930 -0.244689 -0.247818 0.245873 0.213960 0.211661 0.243108 0.233657 0.240646 0.217876 0.221612 0.201953 0.222880 0.233681 0.261152 0.301075 0.281859 0.225993 0.225871 0.239069 0.228554 0.261545
chargesum: 0.00000
title: Mulliken charges with hydrogens summed into heavy atoms:
elementType: Cl O O O N N C C C C C C C C C C C C C C C C C C C C
charge: -0.054171 -0.227533 -0.195822 -0.196572 -0.089407 -0.361897 0.171135 0.015715 0.017403 0.088695 0.056277 0.143438 -0.057620 0.221305 0.447938 0.485217 -0.214875 -0.116142 0.005215 -0.082581 0.005824 -0.002509 -0.095765 0.039139 -0.016134 0.013727
polarizability: 3.30780715e+02 6.89378744e+00 2.44212405e+02 -4.26561363e+00 -9.84176175e+00 1.59517049e+02
1716.lowfreq: -7.9129 -1.6714 0.0013 0.0018 0.0019 4.6800 17.4044 19.1785 27.4047
frequency: 17.3540 18.9408 27.3386 36.0194 52.1480 60.1951 82.1016 106.0474 132.3314 163.0618 176.7123 180.7203 206.4121 217.2102 241.5319 262.8977 279.5258 298.5415 307.4866 310.7861 360.5034 364.2356 371.5596 384.1657 406.4733 421.1631 436.5419 441.9517 462.4416 481.0323 556.0735 567.9050 587.5912 596.3848 601.8964 617.4794 650.8502 676.0907 679.6083 700.7697 705.2487 726.2825 729.1980 740.5014 774.4946 785.9415 808.6285 815.9561 831.0342 859.7597 873.4030 902.6617 913.4887 926.4919 938.9461 960.4204 975.9121 982.7631 983.0097 986.5193 989.9260 995.9186 1001.8882 1009.9786 1026.4699 1032.0402 1048.0952 1075.4179 1077.6539 1080.4231 1108.7009 1112.5960 1126.7199 1154.0314 1168.4055 1170.2193 1171.3641 1180.3404 1182.4716 1186.7635 1211.1863 1231.8791 1270.4550 1290.8646 1293.3424 1309.5680 1313.0696 1318.3581 1332.8614 1342.3399 1343.5169 1365.5213 1378.9060 1382.1374 1400.4553 1427.8686 1440.7959 1446.9152 1462.2995 1463.2856 1471.2458 1472.5969 1482.0834 1485.2329 1578.7341 1594.8056 1605.7495 1614.7121 1642.9973 1724.4691 2861.2407 2893.3371 2899.7590 2988.8179 3008.9383 3011.4346 3032.0099 3050.7407 3075.1576 3078.2820 3113.6455 3123.5331 3136.5035 3147.4179 3152.3770 3162.3690 3178.3158 3197.9153 3203.8592
redmass: 7.5341 5.7361 4.7136 4.8237 5.3194 5.9152 5.9415 5.9215 8.2229 4.2001 4.6688 5.1878 4.6792 5.1963 6.8995 2.3272 4.3769 4.0078 2.6026 5.5101 4.0283 2.9840 3.2992 6.0742 2.8462 6.4370 3.3318 5.1894 3.1058 3.3170 4.6931 3.5005 4.3157 12.2877 4.1884 6.3121 7.5576 2.5126 7.2770 7.8082 2.1993 6.6254 4.2599 1.7983 2.8727 1.4399 3.7202 1.5523 4.8916 1.2488 1.5207 1.3971 1.4758 3.7430 1.9665 3.3009 1.3753 3.4290 1.6217 4.2890 5.7770 1.4508 2.7204 1.9463 2.0981 1.6364 2.5707 2.7552 1.7991 2.3788 1.9125 2.4181 3.7768 2.7536 2.6588 1.1830 2.1455 1.1149 1.1188 1.1001 2.5415 1.4183 1.4295 1.4870 1.5006 1.7188 1.3311 1.3965 2.2083 1.5864 1.5568 1.4033 9.8013 3.8800 1.6532 2.8367 2.0830 1.0852 1.1034 1.1150 2.4436 1.1194 1.5722 1.3366 6.8186 6.1531 6.6128 6.1386 11.2695 12.7826 1.0704 1.0706 1.0694 1.0873 1.0611 1.0608 1.0879 1.0896 1.1039 1.1037 1.0872 1.0861 1.0913 1.0957 1.0885 1.1014 1.0956 1.0956 1.0936
irintensity: 0.3735 0.2812 0.1573 0.4166 0.1430 0.4021 0.6411 1.1640 1.5864 5.3295 1.1912 0.5172 0.2923 0.9559 2.2990 0.9166 1.0738 0.5620 5.6881 18.4320 2.2741 3.7199 6.3571 8.0507 0.1904 3.4895 6.5768 5.2661 8.6587 3.2680 1.1250 0.8487 9.6976 20.8848 5.5386 0.0946 4.0181 29.3975 3.7170 33.5529 39.2403 5.3645 28.3931 57.8990 15.7020 52.5265 3.7099 1.1699 18.7051 0.3130 18.7726 2.3432 3.4530 55.4558 0.2744 27.9971 2.2629 11.8927 1.5240 31.6809 0.0679 2.6471 76.3680 26.7892 7.6835 0.4035 62.9748 29.6229 56.2291 63.4259 43.2304 24.9479 3.7614 76.5753 103.1142 11.4694 29.9077 1.0946 2.3224 0.8044 3.8987 2.1392 21.5997 56.7076 19.6425 22.3634 14.2088 2.8737 165.0544 129.5881 28.2619 3.1197 0.5518 4.1569 1.4165 42.6442 12.5071 10.0444 9.9320 6.0646 136.9036 6.9155 12.2665 21.3786 38.2085 1.0620 63.9160 6.8630 403.9127 256.3662 59.5444 43.4844 75.6064 20.7689 12.2244 15.5900 42.5080 18.3528 10.0160 26.6325 8.4481 0.0569 16.2720 33.8678 8.0986 27.7734 4.0953 0.5842 3.1024
temp: 298.150 k
press: 1.00000 atm
elementType: 17 8 8 8 7 7 6 6 6 6 6 6 6 6 6 6 6 6 6 6 6 6 6 6 6 6 1 1 1 1 1 1 1 1 1 1 1 1 1 1 1 1 1 1 1
symmnumber: 1
zpe: 919187.0 jmol-1
zpe.correction: 0.350100 hartree
zpe.thermalcorrener: 0.372409 hartree
zpe.thermalcorrenthalpy: 0.373353 hartree
zpe.thermalcorrgfe: 0.295639 hartree
zpe.sumelectzpe: -1566.917060 hartree
zpe.sumelectthermal: -1566.894751 hartree
zpe.sumelectthermalent: -1566.893807 hartree
zpe.sumelectthermalfe: -1566.971520 hartree
dipole: 1.8203 -0.7483 -0.5781
dipole: 2.0512
quadrupole: -149.5224 -173.2133 -152.4540
quadrupole: -2.3079 4.8619 -4.0374
quadrupole: 8.8742 -14.8168 5.9425 -2.3079 4.8619 -4.0374
hfenergy: -1567.2671594 hartree
pointgroup: C01 [X(C20H19Cl1N2O3)]
dipole: -0.7220315 0.288911 -0.2155518 debye
polarizability: 329.951532|9.1619381|242.2637445|7.9913658|17.7687322|162.2948927 unknown
InChI: InChI=1S/C20H19ClN2O3/c21-16-7-4-8-17(13-16)23-18(24)20(26-19(23)25)9-11-22(12-10-20)14-15-5-2-1-3-6-15/h1-8,13H,9-12,14H2
charge 0 multiplicity 1
45 atoms
Cl 5.751933 3.232644 0.832641
O  0.891467 -2.408908 0.334833
O  1.149084 1.186717 0.170226
O  3.085304 -3.115766 0.005686
N  -2.491032 0.099595 0.85667
N  2.486274 -0.786745 0.017947
C  0.164062 -1.090657 0.419718
C  -0.920355 -1.065057 -0.680393
C  -0.477227 -0.988317 1.822314
C  -1.884934 0.124941 -0.498273
C  -1.454729 0.202937 1.912334
C  1.279859 -0.059773 0.194142
C  -3.565268 1.110988 1.016321
C  2.254659 -2.204354 0.10713
C  -4.808079 0.79743 0.187798
C  3.78592 -0.206239 -0.217429
C  -5.529511 1.836879 -0.448432
C  -5.287818 -0.533046 0.084059
C  4.089252 1.057549 0.349272
C  4.741222 -0.890597 -1.009113
C  -6.714268 1.55722 -1.168512
C  -6.467903 -0.816269 -0.637838
C  5.35857 1.607902 0.105155
C  6.006885 -0.305662 -1.222305
C  -7.187797 0.228819 -1.264843
C  6.333868 0.953558 -0.670241
H  -1.485533 -2.010884 -0.596507
H  -0.453943 -1.029907 -1.681766
H  0.303497 -0.904506 2.60041
H  -1.031885 -1.929152 1.990379
H  -1.345496 1.084449 -0.685772
H  -2.694207 0.042668 -1.244564
H  -1.953047 0.175205 2.899109
H  -0.88662 1.162385 1.84688
H  -3.209226 2.143255 0.770618
H  -3.839901 1.121039 2.09068
H  -5.162706 2.869164 -0.382443
H  -4.715706 -1.333961 0.565889
H  3.353518 1.599393 0.944644
H  4.509755 -1.870539 -1.430018
H  -7.261847 2.371688 -1.656323
H  -6.828215 -1.848916 -0.711204
H  6.748763 -0.835274 -1.828281
H  -8.104093 0.009483 -1.824497
H  7.313152 1.40962 -0.838401
