program: Gaussian 09
title: 000272084
version: EM64L-G09RevD.01
frameworkgroup: C1[X(C18H21BrO8)]
method: RPBEPBE
basis: SDD
operation: Freq
keyword: #p
keyword: freq=noraman
keyword: PBEPBE/SDD
title: #p freq=noraman PBEPBE/SDD
converged: YES YES NO NO
title: Mulliken charges:
elementType: Br O O O O O O O O C C C C C C C C C C C C C C C C C C H H H H H H H H H H H H H H H H H H H H H
charge: -0.025478 -0.230228 -0.258260 -0.318318 -0.273454 -0.258836 -0.241440 -0.236617 -0.230388 -0.168853 -0.035895 -0.071847 0.019652 -0.109594 -0.767081 0.220020 0.328250 0.305333 -0.504612 0.232158 -0.759965 -0.760509 -0.337088 -0.340739 -0.220491 -0.220001 -0.220544 0.345114 0.283492 0.292523 0.288921 0.235638 0.292111 0.304124 0.207744 0.256496 0.232918 0.256604 0.247908 0.247534 0.260906 0.248402 0.250448 0.269736 0.261679 0.235469 0.232635 0.234419
chargesum: 0.00000
title: Mulliken charges with hydrogens summed into heavy atoms:
elementType: Br O O O O O O O O C C C C C C C C C C C C C C C C C C
charge: -0.025478 -0.230228 -0.258260 -0.318318 -0.273454 -0.258836 -0.241440 -0.236617 -0.230388 0.176261 0.247597 0.220676 0.308573 0.126044 -0.170846 0.220020 0.328250 0.305333 0.192546 0.232158 -0.007919 -0.000752 -0.067351 -0.079060 0.014978 0.012635 0.013875
polarizability: 2.80814119e+02 5.17233431e+00 2.32273180e+02 1.08534960e+00 3.30289406e+01 1.91690905e+02
1716.lowfreq: -7.0205 -1.7134 -0.0009 -0.0007 -0.0005 4.7115 5.1465 21.2108 23.9721
frequency: -4.7396 21.1805 23.9576 30.1221 31.3278 36.3464 40.8684 49.7614 58.9293 61.3790 68.0587 73.3896 78.3931 97.7322 105.4068 120.6315 135.2703 155.9487 161.2332 180.0469 189.4637 195.9864 225.7323 239.3629 264.2146 275.9360 287.5383 299.9397 350.4903 375.5107 401.3686 403.5548 409.6955 438.1495 447.1772 484.4136 506.6024 531.7553 555.3442 563.3645 589.9187 606.3026 613.9977 622.1143 633.7420 655.6368 667.5676 679.4354 700.5216 749.7754 779.6997 794.8630 805.1636 823.0495 849.2778 864.2774 889.0834 892.0428 922.1362 947.0055 954.8682 968.9618 972.2391 988.7927 990.7899 994.2108 995.9250 999.1952 1009.4263 1011.0327 1025.3163 1041.7333 1042.7405 1044.1515 1053.7390 1084.1219 1086.8002 1115.6504 1121.9674 1144.1671 1157.2258 1173.6791 1174.9584 1181.9876 1183.3682 1194.6795 1221.1534 1239.0936 1250.8163 1267.4292 1284.2777 1302.7719 1315.8151 1317.5863 1321.0509 1337.7147 1353.3569 1362.5952 1366.5189 1384.2364 1387.2313 1391.1886 1428.4164 1431.8019 1438.7990 1451.7041 1452.9164 1453.7222 1453.9435 1455.8647 1478.4729 1480.3103 1586.3822 1612.1403 1631.7740 1660.7937 1667.7308 2960.0369 3004.8318 3007.1148 3007.9596 3028.5958 3041.6191 3053.5410 3060.7561 3065.8159 3071.3171 3099.3179 3099.9413 3125.6931 3131.8664 3143.1192 3144.4688 3145.0400 3155.8598 3156.5474 3168.3269 3177.7311
redmass: 1.1362 5.8259 6.8700 6.2549 4.3516 7.3691 5.0405 1.3958 3.9370 6.6550 2.6357 3.2180 7.4189 4.5812 4.1152 3.7326 1.6421 7.3184 5.4663 2.6551 4.0626 5.9100 4.8695 4.9168 6.2188 6.2365 4.8399 5.9431 6.3872 4.2365 4.8678 2.8350 3.6263 4.5037 4.8518 4.8879 4.4840 5.6047 3.2202 3.3936 5.8432 5.5104 6.4297 5.1963 5.6565 5.3435 5.9262 5.2360 1.6086 3.1508 6.5926 2.1534 4.2879 5.9224 5.3159 1.2454 3.8182 4.7931 4.1417 3.0865 1.4196 4.1570 3.6934 3.9258 5.8200 1.9968 1.3949 2.5891 1.3926 4.2523 3.0752 2.9770 1.6805 1.6691 4.4925 2.0375 1.6297 1.5293 1.6662 1.7540 1.5431 1.5979 1.0568 1.8682 1.6838 2.9120 1.4345 2.3250 1.6684 1.2405 1.3325 1.1905 1.3328 1.2927 1.4391 1.2305 1.4316 1.4313 1.5540 1.2493 1.2427 9.9917 1.1151 1.1423 2.2486 1.0539 1.0538 1.0539 1.0526 1.0503 2.2869 1.0534 6.5627 6.0956 11.2909 9.9693 9.9197 1.0353 1.0854 1.0384 1.0379 1.0844 1.0836 1.0857 1.0991 1.0571 1.0853 1.0952 1.0945 1.1019 1.0856 1.1022 1.0891 1.1019 1.1098 1.0938 1.0972 1.0988
irintensity: 1.2725 0.1844 1.0212 0.4347 0.0638 2.3003 0.0797 1.6915 0.4943 1.4003 5.2415 0.1015 1.4428 2.0597 0.6473 1.5019 2.4809 0.5979 0.9990 2.5549 7.3813 6.4846 9.6188 5.3964 1.8832 6.3923 3.0075 8.2416 3.5836 20.2264 9.1932 0.0934 5.0190 9.3771 17.0108 22.3527 14.7377 4.9803 5.9772 5.7362 19.5639 6.2802 1.0980 10.9004 9.1086 13.2209 11.9935 14.2796 84.3182 10.8801 15.0055 21.9738 15.7965 51.5007 14.5029 0.2607 55.0819 60.6761 18.8568 103.3533 2.5931 23.0415 2.4396 76.5205 3.1664 37.1582 0.4498 115.7459 13.7821 246.0453 81.0262 274.5172 10.8701 12.9412 106.0446 4.7616 16.3405 13.6461 24.2568 9.6439 23.6771 15.1491 0.3458 129.9138 224.0633 259.6901 27.8819 235.3268 103.2577 27.0451 14.5635 5.8034 5.3030 2.7706 21.0881 5.3484 1.1143 2.0957 10.6942 70.3180 44.4759 2.5956 11.3003 7.8913 16.8517 23.2904 19.5684 17.8204 19.6939 11.6139 6.3145 9.3711 23.7826 14.8179 164.6367 121.8615 224.4356 71.7235 40.3557 1.0411 1.6308 2.3348 6.0727 11.3736 29.0984 7.5078 3.1887 7.2316 7.0740 17.9379 0.2128 7.6216 9.5115 7.6479 1.2289 16.1008 21.1277 9.2796
temp: 298.150 k
press: 1.00000 atm
elementType: 35 8 8 8 8 8 8 8 8 6 6 6 6 6 6 6 6 6 6 6 6 6 6 6 6 6 6 1 1 1 1 1 1 1 1 1 1 1 1 1 1 1 1 1 1 1 1 1
symmnumber: 1
zpe: 959465.1 jmol-1
zpe.correction: 0.365441 hartree
zpe.thermalcorrener: 0.393163 hartree
zpe.thermalcorrenthalpy: 0.394107 hartree
zpe.thermalcorrgfe: 0.302025 hartree
zpe.sumelectzpe: -1311.733631 hartree
zpe.sumelectthermal: -1311.705909 hartree
zpe.sumelectthermalent: -1311.704965 hartree
zpe.sumelectthermalfe: -1311.797047 hartree
dipole: -0.6304 1.3419 0.3634
dipole: 1.5264
quadrupole: -140.8576 -181.0487 -156.0459
quadrupole: -12.4205 -1.4531 15.3683
quadrupole: 18.4598 -21.7313 3.2714 -12.4205 -1.4531 15.3683
hfenergy: -1312.0990724 hartree
pointgroup: C01 [X(C18H21Br1O8)]
dipole: 0.3775195 0.4277511 -0.1875352 debye
polarizability: 272.110098|-20.6361116|237.0284198|-14.0429291|-31.9618256|195.6396863 unknown
InChI: InChI=1S/C18H21BrO8/c1-10(20)24-15-14(27-17(22)12-7-5-4-6-8-12)13(9-19)26-18(23-3)16(15)25-11(2)21/h4-8,13-16,18H,9H2,1-3H3
charge 0 multiplicity 1
48 atoms
Br -0.809387 4.862724 0.499575
O  -2.352453 1.893225 0.868577
O  -0.969203 -0.240524 -1.686006
O  1.046776 0.540501 0.187371
O  -2.88401 -1.05073 1.39453
O  -3.494726 1.412251 -1.210443
O  1.425976 -1.198795 1.698477
O  0.668376 -1.909375 -1.824743
O  -3.141749 -3.145811 0.391483
C  -1.147647 -0.525428 -0.240945
C  -0.377331 0.5244 0.586139
C  -2.664086 -0.453533 0.046947
C  -0.969687 1.929032 0.334284
C  -3.235913 0.974792 0.141064
C  -0.2269 3.014809 1.093032
C  1.870731 -0.416631 0.825866
C  -0.007414 -1.015083 -2.371852
C  -3.088929 -2.449628 1.425951
C  -4.198965 2.707972 -1.268114
C  3.277679 -0.344267 0.353153
C  0.058269 -0.579735 -3.816548
C  -3.199677 -2.924987 2.854091
C  4.210605 -1.258194 0.909312
C  3.702058 0.598132 -0.61977
C  5.557636 -1.228351 0.497112
C  5.051871 0.624984 -1.02751
C  5.98104 -0.286278 -0.470977
H  -0.765679 -1.539741 -0.029517
H  -0.46456 0.25582 1.656014
H  -3.209591 -1.036918 -0.714475
H  -0.990219 2.130057 -0.753259
H  -4.156305 0.975531 0.758915
H  -0.442242 2.977345 2.171498
H  0.852966 2.975306 0.894448
H  -5.182749 2.639975 -0.760597
H  -3.596019 3.506193 -0.799262
H  -4.344104 2.915247 -2.338682
H  -0.955771 -0.443537 -4.225641
H  0.576928 0.393658 -3.885388
H  0.614288 -1.325103 -4.403148
H  -2.185439 -3.024944 3.282411
H  -3.691486 -3.908369 2.881284
H  -3.751941 -2.197662 3.469781
H  3.859245 -1.980079 1.653711
H  2.974826 1.294488 -1.046563
H  6.275684 -1.935869 0.925033
H  5.380825 1.352293 -1.77746
H  7.028701 -0.26356 -0.791254
