program: Gaussian 09
title: 000272034
version: EM64L-G09RevD.01
frameworkgroup: C1[X(C19H20N2O4S)]
method: RPBEPBE
basis: SDD
operation: Freq
keyword: #p
keyword: freq=noraman
keyword: PBEPBE/SDD
title: #p freq=noraman PBEPBE/SDD
converged: YES YES NO NO
title: Mulliken charges:
elementType: S O O O O N N C C C C C C C C C C C C C C C C C C C H H H H H H H H H H H H H H H H H H H H
charge: 0.265973 -0.248132 -0.450012 -0.457323 -0.447213 -0.175326 -0.015528 -0.119719 -0.184027 -0.147645 -0.048260 -0.348495 0.321668 -0.264377 -0.022771 -0.308981 -0.333661 -0.254146 -0.227963 -0.854719 0.513341 -0.375482 -0.358605 -0.215142 -0.259794 -0.258378 0.250301 0.268590 0.243943 0.223751 0.187566 0.235179 0.377174 0.367278 0.234718 0.366833 0.253717 0.227944 0.230324 0.313191 0.270685 0.239126 0.267951 0.234366 0.242555 0.239527
chargesum: 0.00000
title: Mulliken charges with hydrogens summed into heavy atoms:
elementType: S O O O O N N C C C C C C C C C C C C C C C C C C C
charge: 0.265973 -0.248132 -0.072838 -0.090045 -0.080380 -0.175326 -0.015528 0.130582 0.084563 0.096298 0.175491 0.074250 0.321668 -0.264377 -0.022771 -0.074262 -0.079944 -0.026202 0.002361 -0.270844 0.513341 -0.136356 -0.090654 0.019224 -0.017239 -0.018850
polarizability: 2.46651084e+02 1.47413996e+01 2.74010843e+02 -2.55185032e+01 -2.18425176e+01 2.15845502e+02
1716.lowfreq: -9.6203 -6.6018 -2.4449 -0.0008 0.0008 0.0017 14.9816 31.0714 34.3362
frequency: 14.8530 31.0488 34.2521 44.6171 46.9444 57.2070 80.3701 83.9016 90.1547 115.6493 122.9150 146.2125 171.2065 181.6854 201.1355 230.6593 261.6496 282.7927 296.7159 309.7287 336.8900 354.1232 368.1360 382.1461 386.7017 401.1250 421.8893 433.7324 439.7545 465.2222 473.6056 494.7110 508.8404 532.3584 546.6757 575.3616 577.6721 589.8125 610.0075 615.5487 620.3640 632.9366 658.5565 705.0696 751.6373 758.3334 766.3431 777.3884 802.3565 831.5549 854.6467 860.7395 871.5722 883.6711 893.9365 908.4132 931.3747 937.9913 957.1382 977.5831 979.3200 982.8426 988.7521 997.3478 1000.2722 1011.7606 1018.4785 1024.2594 1038.2001 1065.7445 1072.9924 1076.7744 1088.6617 1128.7594 1133.7485 1144.6137 1146.8313 1165.8229 1172.4105 1186.8554 1190.1438 1198.0904 1219.8857 1226.7164 1227.5210 1233.4180 1254.4512 1260.6920 1275.7197 1293.5858 1296.0190 1314.4171 1317.9260 1327.8291 1356.4572 1366.8246 1379.0502 1389.3591 1393.9359 1396.4055 1416.2975 1418.3512 1438.0106 1450.2525 1455.0712 1471.0652 1481.0695 1481.2019 1585.5418 1589.1772 1607.9815 1622.0099 2959.0299 2971.9186 2985.0127 3004.2315 3036.6798 3046.2041 3087.8964 3126.1090 3127.4360 3131.2747 3135.5114 3143.7027 3150.9936 3153.4632 3166.3099 3169.3489 3175.0258 3472.4529 3513.4497 3566.6139
redmass: 5.3037 5.7423 5.6274 5.3760 5.3729 5.5490 6.3404 5.4499 4.5632 4.6436 6.3881 5.1690 6.2670 5.2876 4.0585 4.3932 5.7492 5.3129 5.8802 4.6017 2.5783 4.0384 4.9850 2.0279 2.2145 2.8617 1.9893 1.6254 2.8144 4.2675 1.3737 2.7933 4.0600 4.0272 5.6642 6.7214 6.8333 4.3558 4.7349 6.3202 6.4334 6.3707 7.6768 1.8490 1.6864 3.1564 3.6358 1.9503 3.8028 6.6079 1.4629 1.2523 5.8109 1.9115 1.6718 6.4564 1.4272 1.3850 6.3599 6.7101 1.3078 1.3910 5.9701 3.4200 1.3809 2.2597 3.0340 2.3391 4.2772 3.0310 1.9488 1.5774 3.4650 2.1454 1.6448 1.2291 1.0986 1.2308 1.0520 1.7586 1.3657 1.3197 1.3979 1.5294 1.7819 3.3866 1.2043 1.2265 1.3290 1.6121 1.3530 1.3030 3.3974 1.2715 1.4874 3.0194 8.3967 1.6330 1.2538 1.8010 1.7935 2.1930 2.1112 1.8935 1.8089 2.9834 1.1003 2.2594 5.9805 6.8751 6.0156 7.6336 1.0713 1.0822 1.0829 1.0856 1.0851 1.0585 1.0960 1.1015 1.0932 1.0879 1.0858 1.0920 1.0901 1.0963 1.0951 1.1014 1.0996 1.0670 1.0671 1.0660
irintensity: 0.0691 1.1010 0.6750 0.1215 1.2711 0.4098 1.0354 2.2129 0.7079 7.5088 0.7557 0.1466 1.1991 2.7632 5.7646 8.3631 0.2627 1.9662 0.6477 2.7665 0.3935 5.4302 2.0893 16.0372 9.8023 0.1173 37.5568 18.9578 8.9043 1.9700 249.2830 60.1976 19.0495 10.2451 8.5886 1.8745 8.1824 0.8639 43.7177 0.3918 4.5230 2.1605 3.3000 61.7036 68.7020 39.8846 4.3986 37.7425 8.6634 38.7499 3.1458 3.4395 41.5371 15.5333 3.8400 13.3912 2.9465 2.7847 142.1991 156.6479 0.1087 0.3916 0.6225 30.3678 3.8311 22.1419 11.1055 4.8440 7.2893 85.9918 38.6836 14.0046 3.7461 4.1210 9.0155 1.9867 1.2567 8.2996 0.0293 71.0053 13.5950 40.2479 0.9250 28.4583 4.3727 12.8868 14.7111 1.1472 3.5830 5.7984 12.4582 62.3861 49.3862 0.6401 8.9454 65.4168 0.0649 6.7432 52.8228 38.3464 27.6000 56.4277 12.4294 5.4488 11.3502 3.8606 3.1412 14.4753 0.4728 2.0367 4.3371 3.6071 23.0728 6.3987 56.9685 37.2129 7.9572 16.7538 24.7311 0.3737 4.2063 0.1825 1.5890 7.2769 11.2528 21.7755 17.9399 15.9645 18.8471 36.3513 132.1093 13.9948
temp: 298.150 k
press: 1.00000 atm
elementType: 16 8 8 8 8 7 7 6 6 6 6 6 6 6 6 6 6 6 6 6 6 6 6 6 6 6 1 1 1 1 1 1 1 1 1 1 1 1 1 1 1 1 1 1 1 1
symmnumber: 1
zpe: 940152.4 jmol-1
zpe.correction: 0.358085 hartree
zpe.thermalcorrener: 0.381902 hartree
zpe.thermalcorrenthalpy: 0.382846 hartree
zpe.thermalcorrgfe: 0.302617 hartree
zpe.sumelectzpe: -1542.557355 hartree
zpe.sumelectthermal: -1542.533539 hartree
zpe.sumelectthermalent: -1542.532595 hartree
zpe.sumelectthermalfe: -1542.612824 hartree
dipole: -3.7480 -2.6936 -3.7395
dipole: 5.9403
quadrupole: -179.3810 -149.0959 -156.7848
quadrupole: 8.8307 -5.0201 -5.2009
quadrupole: -17.6271 12.6580 4.9691 8.8307 -5.0201 -5.2009
hfenergy: -1542.9154405 hartree
pointgroup: C01 [X(C19H20N2O4S1)]
dipole: 1.753993 -0.7153075 1.3688906 debye
polarizability: 246.1665306|-18.8216972|271.3996631|-30.1720111|15.4751636|218.9412353 unknown
InChI: InChI=1S/C19H20N2O4S/c22-10-15-16(23)17(24)18(25-15)21-14-9-5-4-8-13(14)20-19(21)26-11-12-6-2-1-3-7-12/h1-9,15-18,22-24H,10-11H2
charge 0 multiplicity 1
46 atoms
S  1.567363 -0.023376 -2.716516
O  -2.380778 -0.633198 -1.198237
O  0.142137 -2.249546 0.896364
O  -2.844146 -2.518564 1.908413
O  -5.312793 -2.513578 0.231406
N  -0.378495 0.669054 -0.769789
N  1.093179 2.347668 -1.323914
C  -0.962991 -0.664746 -0.738992
C  -0.970874 -1.341672 0.669171
C  -2.257537 -2.176005 0.613163
C  -3.234544 -1.274144 -0.159408
C  -4.395315 -2.035239 -0.809368
C  -0.760311 1.79508 -0.006999
C  0.727302 1.081992 -1.557903
C  0.18236 2.822368 -0.35244
C  -1.811255 2.027116 0.905844
C  0.098378 4.101524 0.242044
C  -1.878113 3.308741 1.491769
C  -0.937933 4.330565 1.169086
C  3.329937 0.083943 -1.919117
C  3.387052 -0.614477 -0.5875
C  3.690258 -1.999139 -0.497326
C  3.104975 0.104316 0.606036
C  3.703776 -2.654795 0.753103
C  3.112277 -0.55189 1.85905
C  3.409655 -1.934944 1.936769
H  -0.378863 -1.286845 -1.441155
H  -1.041596 -0.580544 1.471705
H  -2.035355 -3.094304 0.028351
H  -3.650607 -0.506697 0.526356
H  -3.999384 -2.871401 -1.424233
H  -4.986219 -1.367471 -1.456459
H  0.983146 -1.753678 1.079882
H  -2.210315 -3.099368 2.400812
H  -2.562896 1.270785 1.147673
H  -4.77618 -2.84777 1.001159
H  0.81491 4.882741 -0.028417
H  -2.680681 3.526004 2.204931
H  -1.033524 5.312939 1.643681
H  3.534511 1.163105 -1.854493
H  3.973381 -0.380096 -2.684045
H  3.906063 -2.565021 -1.41154
H  2.885681 1.176552 0.547693
H  3.937551 -3.723429 0.806911
H  2.90233 0.016628 2.771768
H  3.420588 -2.442883 2.907011
