program: Gaussian 09
title: 000271978
version: EM64L-G09RevD.01
frameworkgroup: C1[X(C14H16O3)]
method: RPBEPBE
basis: SDD
operation: Freq
keyword: #pfreq=noraman
keyword: PBEPBE/SDD
title: #p freq=noraman PBEPBE/SDD
converged: YES YES NO NO
title: Mulliken charges:
elementType: O O O C C C C C C C C C C C C C C H H H H H H H H H H H H H H H H
charge: -0.451113 -0.292622 -0.196990 -0.065206 0.393949 -0.164658 -0.356293 -0.387823 0.213890 0.029199 -0.681550 -0.680554 -0.022432 -0.236280 -0.224138 -0.239892 -0.494228 0.236362 0.238884 0.277413 0.216267 0.220003 0.226444 0.218500 0.215129 0.233494 0.223575 0.224281 0.225691 0.370361 0.235289 0.245884 0.249164
chargesum: 0.00000
title: Mulliken charges with hydrogens summed into heavy atoms:
elementType: O O O C C C C C C C C C C C C C C
charge: -0.080752 -0.292622 -0.196990 -0.065206 0.393949 0.071704 -0.117409 -0.110410 0.213890 0.029199 -0.018836 -0.013432 -0.022432 -0.012705 0.000143 -0.014201 0.236110
polarizability: 1.96848736e+02 -4.82898168e+00 1.59031503e+02 4.70411770e+00 1.88193565e+01 1.20315100e+02
1716.lowfreq: -2.2938 0.0002 0.0005 0.0006 5.7638 7.7141 22.6613 25.2799 30.4411
frequency: 22.2031 24.8118 30.3785 40.0468 51.8210 79.2067 89.8428 121.2507 144.3404 185.4966 198.2369 215.8894 229.9401 250.9923 257.5291 280.9794 314.7185 339.6993 370.5017 385.6585 403.6311 408.7557 432.1344 494.9017 511.4725 526.3699 582.3509 616.3373 632.8438 690.5634 700.8762 724.4712 758.5646 799.7348 840.3765 855.0147 904.0531 920.8034 932.1472 953.9488 963.5089 976.0454 980.1165 991.4132 997.1010 1028.7633 1057.9646 1089.6684 1112.6924 1114.2275 1119.3910 1132.3160 1149.2663 1166.9603 1172.5954 1188.5231 1207.1275 1280.9988 1313.4393 1315.9184 1334.8418 1375.9819 1384.8586 1393.9070 1422.5613 1436.4489 1452.4962 1464.3094 1465.0940 1469.7483 1477.5984 1480.7165 1488.4297 1596.6917 1612.7130 1656.0497 2261.8630 2970.2152 2983.7350 2985.7727 3008.2554 3081.8438 3087.0658 3090.5870 3095.2004 3113.1415 3123.9269 3135.5965 3149.2352 3153.4788 3162.2361 3178.3736 3537.9378
redmass: 2.7946 3.8018 4.7329 4.4213 4.1501 3.1441 1.2798 3.6038 3.6895 3.0149 3.6709 1.0375 5.1879 3.3288 1.5443 3.1978 3.2524 3.4492 3.3263 3.4705 2.8569 1.7425 8.1420 3.7130 4.8325 4.3752 6.2136 6.4054 5.6121 7.3946 2.1115 2.8831 2.5744 3.5337 4.2205 1.2654 2.6173 1.1747 1.6200 1.4562 6.1827 6.2674 1.4005 5.6788 1.3503 2.2074 1.9903 1.6018 2.5586 1.2681 6.2864 2.1908 1.4483 1.7431 1.1583 1.1728 2.2761 1.3212 1.3903 1.5737 1.4904 1.1891 9.6174 1.1980 1.1652 2.2222 1.0496 1.0506 1.0448 1.0492 1.0443 2.2777 1.0555 6.4951 6.1227 10.8631 11.9217 1.0823 1.0346 1.0349 1.0292 1.1008 1.1001 1.1011 1.1005 1.1050 1.0848 1.0890 1.0940 1.1052 1.0987 1.0958 1.0650
irintensity: 0.1115 0.2744 3.3523 0.9976 0.6936 1.5839 0.4336 0.2678 1.4654 0.7789 4.5423 0.0113 4.7469 4.6190 2.0231 7.5663 16.1888 39.7597 17.2233 28.7637 0.0652 81.6383 16.2281 0.6621 1.3620 3.3142 8.4239 0.0366 18.0615 26.9845 40.7172 68.3602 29.3388 2.0218 35.3099 1.1394 19.8649 4.1043 10.9747 0.0499 54.7202 58.4105 1.3147 0.7455 1.2424 10.5945 15.3259 3.6110 17.4009 0.8546 304.7245 11.6105 0.8728 44.5416 7.7673 8.3687 27.9073 0.0965 6.9676 28.5259 69.6848 14.4245 0.5916 8.3341 15.2145 21.2815 16.2613 14.0604 3.9449 2.9587 15.3891 13.8667 15.3636 0.0786 2.1487 135.3064 38.0807 12.8546 27.1688 34.9250 31.4236 0.7313 80.3649 23.2397 37.9776 21.0251 0.2405 12.4126 35.3226 13.5181 19.8449 7.9867 26.8746
temp: 298.150 k
press: 1.00000 atm
elementType: 8 8 8 6 6 6 6 6 6 6 6 6 6 6 6 6 6 1 1 1 1 1 1 1 1 1 1 1 1 1 1 1 1
symmnumber: 1
zpe: 689718.0 jmol-1
zpe.correction: 0.262700 hartree
zpe.thermalcorrener: 0.281224 hartree
zpe.thermalcorrenthalpy: 0.282168 hartree
zpe.thermalcorrgfe: 0.213321 hartree
zpe.sumelectzpe: -767.428505 hartree
zpe.sumelectthermal: -767.409980 hartree
zpe.sumelectthermalent: -767.409036 hartree
zpe.sumelectthermalfe: -767.477884 hartree
dipole: -2.8160 1.4138 -0.2365
dipole: 3.1599
quadrupole: -86.8596 -82.1050 -106.2782
quadrupole: -1.4450 0.5765 3.3018
quadrupole: 4.8880 9.6426 -14.5306 -1.4450 0.5765 3.3018
hfenergy: -767.6912044 hartree
pointgroup: C01 [X(C14H16O3)]
dipole: 1.15652 0.4407591 0.117047 debye
polarizability: 196.9358639|2.1527628|154.6283592|6.6070232|-22.2738161|124.6311163 unknown
InChI: InChI=1S/C14H16O3/c1-11(2)9-10-14(16,13(15)17-3)12-7-5-4-6-8-12/h4-8,11,16H,1-3H3
charge 0 multiplicity 1
33 atoms
O  -0.135679 0.978812 -1.991897
O  0.797827 2.760444 -0.310518
O  -0.186002 1.789063 1.565674
C  -0.04218 0.504407 -0.602875
C  -1.356875 -0.225831 -0.276619
C  3.38603 -1.855616 -0.081519
C  -1.422912 -1.134004 0.805215
C  -2.5186 0.052562 -1.033342
C  0.141901 1.7281 0.367471
C  1.156971 -0.343481 -0.404588
C  4.576607 -1.014674 0.457518
C  3.088445 -3.071353 0.840594
C  2.178191 -1.022228 -0.260511
C  -2.645055 -1.762567 1.128645
C  -3.73928 -0.581919 -0.710982
C  -3.807707 -1.48868 0.371443
C  1.101394 3.971455 0.491135
H  3.667487 -2.247725 -1.081108
H  -0.522246 -1.34807 1.390171
H  -2.44825 0.743641 -1.877245
H  5.477899 -1.648164 0.546048
H  4.340611 -0.605098 1.456011
H  4.806961 -0.170904 -0.215989
H  2.816574 -2.730516 1.855705
H  3.984026 -3.714251 0.918537
H  2.255176 -3.677074 0.444638
H  -2.690091 -2.463851 1.969365
H  -4.634742 -0.369446 -1.305975
H  -4.755759 -1.978504 0.62143
H  0.578532 1.657103 -2.119913
H  1.610406 4.651812 -0.205282
H  1.752727 3.706446 1.340549
H  0.165811 4.414112 0.870712
