program: Gaussian 09
title: 000271969
version: EM64L-G09RevD.01
frameworkgroup: C1[X(C12H14O3)]
method: RPBEPBE
basis: SDD
operation: Freq
keyword: #pfreq=noraman
keyword: PBEPBE/SDD
title: #p freq=noraman PBEPBE/SDD
converged: YES YES NO NO
title: Mulliken charges:
elementType: O O O C C C C C C C C C C C C H H H H H H H H H H H H H H
charge: -0.488419 -0.307441 -0.228909 -0.051008 0.392972 -0.194029 0.216214 -0.378982 -0.391712 -0.236981 -0.220622 -0.155438 -0.242401 -0.743488 -0.492923 0.257244 0.265679 0.277803 0.225408 0.225014 0.374952 0.263682 0.227611 0.224148 0.225191 0.222498 0.235979 0.249553 0.248403
chargesum: 0.00000
title: Mulliken charges with hydrogens summed into heavy atoms:
elementType: O O O C C C C C C C C C C C C
charge: -0.113466 -0.307441 -0.228909 -0.051008 0.392972 0.063215 0.216214 -0.113303 -0.113908 -0.011573 0.004391 0.108244 -0.014789 -0.071651 0.241012
polarizability: 1.60049544e+02 7.23754409e+00 1.26785413e+02 3.51217588e+00 8.03057475e+00 1.25952396e+02
1716.lowfreq: -6.7815 0.0004 0.0006 0.0008 5.9794 10.2191 33.6462 39.6653 52.3329
frequency: 33.5936 39.6352 52.2696 76.2231 100.4825 124.1930 128.0608 171.0809 195.5917 214.7659 229.6270 264.4429 300.8870 310.4573 328.0172 338.9014 370.8189 393.1960 408.2105 488.2287 537.6504 598.8202 615.4145 674.8607 701.4797 713.1630 751.7141 776.2238 778.6828 863.3696 867.0530 910.2115 939.4228 957.8308 975.5985 987.4989 989.3384 994.7317 1002.2481 1028.7037 1048.7787 1073.1440 1092.0527 1116.2376 1124.0101 1145.0196 1159.1076 1163.3776 1171.9982 1190.6323 1262.3252 1291.2002 1314.4833 1335.5946 1380.3519 1394.0662 1423.1701 1433.2527 1453.0864 1461.9700 1464.7106 1470.8888 1475.0424 1591.0899 1606.1265 1647.1098 1688.6935 2966.2992 3010.5160 3040.6936 3078.0280 3116.4161 3122.5127 3126.0426 3131.9405 3133.4405 3144.9179 3155.5860 3158.2526 3170.3308 3526.2320
redmass: 4.2049 3.9637 3.6540 1.1275 3.4313 2.5609 2.0055 3.7949 1.3374 4.6332 3.8900 4.7286 5.7473 3.8734 1.9470 4.1371 3.1567 2.4133 2.5001 3.9037 4.9304 6.6917 6.4109 4.9781 4.5903 1.9178 2.8653 2.3789 2.1667 1.3038 3.0766 2.8475 1.4938 2.6671 1.1322 2.8378 1.8984 2.5768 1.4916 2.1990 1.5442 2.0101 2.4617 1.2644 3.2667 1.7612 2.8254 2.6361 1.1528 1.1819 1.3140 1.2523 1.3352 1.4463 8.7671 1.2358 1.1718 2.2113 1.0495 1.0477 1.0514 1.0674 2.1247 6.2865 6.0013 10.4001 6.3324 1.0364 1.0291 1.0968 1.0986 1.1051 1.0847 1.0955 1.0885 1.0867 1.0937 1.1054 1.0975 1.0974 1.0650
irintensity: 6.9976 0.5445 0.0725 0.1160 1.2356 0.6497 1.3782 0.7743 2.4107 1.2722 6.1734 3.6693 7.9821 6.0967 64.6660 21.6830 18.7427 34.9821 14.3473 9.8115 6.7466 18.7124 0.1431 12.2643 4.8975 66.1447 29.7493 19.7459 17.5540 1.3187 16.0975 17.8600 3.5933 55.8536 39.0948 0.6624 2.4669 25.9467 4.6832 9.2110 0.3960 52.5426 15.9187 0.3403 157.6926 77.7647 55.8158 83.5453 1.8618 2.8663 4.6369 2.6808 3.8764 73.8350 0.1010 10.5614 19.7329 13.1216 16.1515 14.0975 14.9866 17.9355 24.8375 0.5721 7.6388 111.7361 6.1468 41.2752 30.3221 24.9269 22.5624 20.9220 0.1049 1.1805 17.1497 5.1798 18.1887 12.6168 23.1785 16.3359 58.7569
temp: 298.150 k
press: 1.00000 atm
elementType: 8 8 8 6 6 6 6 6 6 6 6 6 6 6 6 1 1 1 1 1 1 1 1 1 1 1 1 1 1
symmnumber: 1
zpe: 604661.0 jmol-1
zpe.correction: 0.230303 hartree
zpe.thermalcorrener: 0.245996 hartree
zpe.thermalcorrenthalpy: 0.246940 hartree
zpe.thermalcorrgfe: 0.186346 hartree
zpe.sumelectzpe: -690.204345 hartree
zpe.sumelectthermal: -690.188653 hartree
zpe.sumelectthermalent: -690.187709 hartree
zpe.sumelectthermalfe: -690.248303 hartree
dipole: 0.5297 -1.9146 0.7525
dipole: 2.1242
quadrupole: -79.9043 -78.0384 -88.3337
quadrupole: -3.8004 2.5207 -3.3818
quadrupole: 2.1879 4.0537 -6.2416 -3.8004 2.5207 -3.3818
hfenergy: -690.4346485 hartree
pointgroup: C01 [X(C12H14O3)]
dipole: 0.0013167 -0.7535973 0.3613213 debye
polarizability: 160.829686|-1.309203|126.5024549|7.3411394|6.8387391|125.4552111 unknown
InChI: InChI=1S/C12H14O3/c1-3-9-12(14,11(13)15-2)10-7-5-4-6-8-10/h3-9,14H,1-2H3
charge 0 multiplicity 1
29 atoms
O  0.863351 0.132797 1.731984
O  1.004775 -2.307528 0.884299
O  1.048221 -1.777305 -1.38279
C  0.57214 0.007849 0.307362
C  -0.935481 0.279584 0.024278
C  1.430486 1.010973 -0.465685
C  0.906772 -1.422746 -0.194949
C  -1.509264 0.009782 -1.243929
C  -1.729748 0.863886 1.039178
C  -2.867613 0.31361 -1.486243
C  -3.087371 1.167655 0.792193
C  2.306975 1.858472 0.12351
C  -3.66223 0.893282 -0.470079
C  3.139206 2.879126 -0.617583
C  1.281306 -3.725711 0.54511
H  1.269556 1.011535 -1.550854
H  -0.903607 -0.446605 -2.035078
H  -1.267898 1.078829 2.007195
H  -3.303994 0.09714 -2.467969
H  -3.694484 1.620811 1.58438
H  0.801135 -0.772743 2.135134
H  2.415775 1.806632 1.214623
H  -4.715458 1.129112 -0.66009
H  2.962657 2.841614 -1.70696
H  2.91104 3.904563 -0.266374
H  4.219447 2.714853 -0.436418
H  1.334048 -4.243542 1.512526
H  2.235206 -3.799913 -0.002254
H  0.466052 -4.126114 -0.079717
