program: Gaussian 09
title: 000271976
version: EM64L-G09RevD.01
frameworkgroup: C1[X(C13H14O3)]
method: RPBEPBE
basis: SDD
operation: Freq
keyword: #pfreq=noraman
keyword: PBEPBE/SDD
title: #p freq=noraman PBEPBE/SDD
converged: YES YES NO NO
title: Mulliken charges:
elementType: O O O C C C C C C C C C C C C C H H H H H H H H H H H H H H
charge: -0.448762 -0.233576 -0.250493 -0.051734 0.413119 -0.374560 -0.382743 0.194686 -0.231532 -0.225440 0.050976 -0.240578 -0.463494 -0.032817 -0.659590 -0.501189 0.241378 0.269829 0.223515 0.225344 0.226660 0.366101 0.241174 0.236576 0.218409 0.232555 0.222235 0.248361 0.240430 0.245158
chargesum: 0.00000
title: Mulliken charges with hydrogens summed into heavy atoms:
elementType: O O O C C C C C C C C C C C C C
charge: -0.082661 -0.233576 -0.250493 -0.051734 0.413119 -0.133182 -0.112914 0.194686 -0.008017 -0.000096 0.050976 -0.013918 0.014256 -0.032817 0.013610 0.232760
polarizability: 1.78951874e+02 -3.50618939e+00 1.40083783e+02 -8.36728738e+00 -1.90617037e+01 1.21788339e+02
1716.lowfreq: -7.6044 -6.6425 -0.0006 -0.0004 0.0004 2.1380 25.0221 29.8029 40.9959
frequency: 24.6656 29.2495 40.9865 45.5016 58.8202 71.5933 87.5301 139.4845 154.5957 180.2605 199.8829 231.0374 257.9184 285.3288 304.4474 329.4722 348.2107 400.7876 407.9874 413.1338 419.8389 497.1400 513.8970 587.4242 615.2825 628.7511 693.4033 701.5529 726.7182 771.9665 778.1736 844.1991 854.8360 875.3038 922.3035 931.8677 979.2148 983.5925 990.7366 994.4646 998.0206 1026.9359 1062.6669 1082.6217 1084.5414 1112.5551 1142.1353 1150.2738 1170.9800 1177.1686 1184.7878 1217.2587 1253.3160 1312.7767 1316.9522 1338.0104 1383.7540 1391.0888 1420.7703 1435.2575 1453.8540 1459.6545 1460.4751 1473.6695 1477.6514 1484.6669 1595.5732 1607.7146 1617.0344 2271.9813 2977.4065 2991.5837 3009.3485 3022.6121 3090.5790 3099.1538 3114.4962 3123.3992 3134.7500 3148.9388 3159.1253 3160.5361 3172.0331 3461.5720
redmass: 2.8843 3.2291 4.2030 3.7602 3.2466 3.8600 1.1830 3.3978 3.8602 3.0485 1.9084 3.6676 3.7496 2.4209 2.4435 5.1742 5.7906 2.6732 3.1863 5.9712 2.7290 3.8487 5.2171 7.4678 6.3812 6.0750 7.9739 1.9501 3.2508 2.2365 1.1809 3.7608 1.2517 5.3746 3.2352 1.9094 1.4272 3.2006 5.5528 2.1271 2.2254 2.1751 1.9785 1.4700 1.5862 1.2626 2.6285 1.4716 1.0596 5.6741 1.1479 4.2595 1.1470 1.3504 1.4981 1.4006 9.7704 1.1928 1.1933 2.2189 1.0501 1.0746 1.0524 1.0416 2.2487 1.0550 6.4740 6.6848 8.2076 11.8580 1.0589 1.0352 1.0293 1.1003 1.1005 1.1014 1.1051 1.0847 1.0889 1.0935 1.1051 1.0973 1.0976 1.0649
irintensity: 0.2014 0.0944 0.5319 1.1138 2.0968 1.7100 0.1774 1.4882 1.9453 2.6018 4.3855 8.8738 1.8676 93.3390 3.9655 15.8078 6.4198 24.3847 23.3930 4.9729 10.0914 6.8459 5.0396 13.5627 0.0787 16.1904 15.8874 37.9016 64.8334 26.6329 6.3414 10.9186 0.2763 3.7438 24.3883 20.8408 0.7410 18.0482 3.6093 33.2315 35.9657 10.7820 4.3587 2.6854 3.6953 0.0288 64.7803 6.0243 1.0576 253.5174 8.7855 38.5910 0.6869 2.5912 22.7835 60.8178 0.2086 8.9114 18.8899 17.9241 15.4457 3.7359 11.8660 12.9851 18.6965 10.8384 0.1452 58.9180 127.9587 31.8911 28.6906 33.7331 28.4505 8.0684 47.2911 32.7540 20.9416 0.0426 12.1011 28.1692 9.0217 21.6545 11.3097 40.6064
temp: 298.150 k
press: 1.00000 atm
elementType: 8 8 8 6 6 6 6 6 6 6 6 6 6 6 6 6 1 1 1 1 1 1 1 1 1 1 1 1 1 1
symmnumber: 1
zpe: 616981.4 jmol-1
zpe.correction: 0.234996 hartree
zpe.thermalcorrener: 0.252151 hartree
zpe.thermalcorrenthalpy: 0.253096 hartree
zpe.thermalcorrgfe: 0.187486 hartree
zpe.sumelectzpe: -728.206233 hartree
zpe.sumelectthermal: -728.189077 hartree
zpe.sumelectthermalent: -728.188133 hartree
zpe.sumelectthermalfe: -728.253742 hartree
dipole: -1.4144 0.4185 3.4107
dipole: 3.7160
quadrupole: -78.1528 -89.3104 -92.4547
quadrupole: 0.8530 -0.4599 3.0258
quadrupole: 8.4865 -2.6711 -5.8154 0.8530 -0.4599 3.0258
hfenergy: -728.4412288 hartree
pointgroup: C01 [X(C13H14O3)]
dipole: -0.6143189 -0.0930054 -1.3233744 debye
polarizability: 179.6134783|-1.2560266|140.1745368|4.4387033|-19.6058072|121.0359811 unknown
InChI: InChI=1S/C13H14O3/c1-3-4-10-13(15,12(14)16-2)11-8-6-5-7-9-11/h5-9,15H,3H2,1-2H3
charge 0 multiplicity 1
30 atoms
O  0.112761 -0.808307 2.15624
O  -0.109105 -1.784196 -1.370442
O  -0.153899 -2.999931 0.613199
C  -0.115736 -0.521818 0.734126
C  1.051208 0.353611 0.234684
C  0.872016 1.292513 -0.807012
C  2.332948 0.175971 0.807182
C  -0.118585 -1.907956 -0.004355
C  1.969439 2.047535 -1.276683
C  3.428679 0.933022 0.337093
C  -1.446357 0.088818 0.520687
C  3.251889 1.86925 -0.707968
C  -3.909187 1.179134 0.245473
C  -2.573702 0.573502 0.391744
C  -3.870399 2.587197 -0.406951
C  -0.148517 -3.055051 -2.141216
H  -0.122591 1.43173 -1.243324
H  2.451467 -0.52868 1.635303
H  1.823454 2.776088 -2.082221
H  4.417119 0.797181 0.790383
H  4.102239 2.457726 -1.070955
H  -0.218128 -1.734171 2.326434
H  -4.381532 1.248898 1.245238
H  -4.553632 0.508646 -0.356857
H  -4.891616 3.001862 -0.481345
H  -3.255262 3.279315 0.193195
H  -3.440178 2.538567 -1.422418
H  0.728824 -3.673779 -1.890686
H  -0.128127 -2.740591 -3.19312
H  -1.071391 -3.610286 -1.904728
