program: Gaussian 09
title: 000271979
version: EM64L-G09RevD.01
frameworkgroup: C1[X(C16H20O3)]
method: RPBEPBE
basis: SDD
operation: Freq
keyword: #pfreq=noraman
keyword: PBEPBE/SDD
title: #p freq=noraman PBEPBE/SDD
converged: YES YES NO NO
title: Mulliken charges:
elementType: O O O C C C C C C C C C C C C C C C C H H H H H H H H H H H H H H H H H H H H
charge: -0.447548 -0.233591 -0.249418 -0.349867 -0.361961 -0.348624 -0.493417 -0.050219 0.415378 -0.694696 -0.023271 0.014494 -0.374099 -0.383212 0.188931 -0.234004 -0.226170 -0.242244 -0.501462 0.221561 0.187893 0.203649 0.200192 0.190318 0.193508 0.236964 0.236210 0.213625 0.210973 0.214522 0.239451 0.269529 0.224493 0.225500 0.365995 0.226899 0.240373 0.244908 0.248437
chargesum: 0.00000
title: Mulliken charges with hydrogens summed into heavy atoms:
elementType: O O O C C C C C C C C C C C C C C C C
charge: -0.081554 -0.233591 -0.249418 0.059587 0.041880 0.035202 -0.020243 -0.050219 0.415378 -0.055576 -0.023271 0.014494 -0.134649 -0.113682 0.188931 -0.009511 -0.000670 -0.015345 0.232255
polarizability: 2.00070300e+02 -1.02516183e+01 1.96345506e+02 1.75277542e+01 7.34279859e+00 1.41756385e+02
1716.lowfreq: -0.0006 -0.0003 0.0002 4.0477 4.7721 6.7710 14.4524 20.9203 35.3234
frequency: 12.4173 20.7864 35.2829 43.8302 52.6243 59.7455 68.3900 81.1315 102.1098 119.1014 146.9247 170.0533 174.0855 189.0975 227.4901 233.7892 250.6271 282.4411 288.6132 311.4126 348.3950 366.7459 387.7934 401.7421 407.3714 419.2530 425.9707 498.5455 544.9258 587.2583 615.9674 630.0380 692.9941 701.6218 724.8641 733.6153 771.7097 781.2134 833.8665 853.1381 855.4818 876.2442 910.3714 920.9152 928.4574 944.9581 979.5608 984.1732 990.9755 992.4716 998.1018 1027.0582 1045.3636 1076.8643 1085.7556 1106.8471 1107.9591 1112.6391 1142.4470 1150.5450 1171.1165 1175.8950 1184.6152 1199.6813 1215.7151 1217.6516 1269.9291 1282.2333 1291.0592 1312.8789 1317.8443 1337.1341 1338.2899 1361.5647 1383.8330 1391.2674 1420.9977 1435.9248 1452.6363 1454.5518 1460.9015 1463.3187 1469.4734 1477.1536 1477.9680 1479.7560 1489.9816 1595.4721 1608.0624 1617.1814 2270.1318 2959.4114 2965.7688 2969.3154 2973.0995 2978.0034 2999.5167 3009.3092 3016.6330 3023.3826 3046.9660 3069.9968 3071.7458 3114.4998 3123.4939 3134.8379 3148.9749 3158.9602 3160.2128 3172.3536 3463.5150
redmass: 4.0859 4.3874 3.7490 4.8868 4.1226 4.2334 3.0860 1.8509 1.1127 2.6092 3.7439 3.0155 2.8394 3.2468 2.4672 1.5043 4.3322 3.9157 2.4908 3.7826 6.5719 3.0641 2.9615 2.8620 3.7226 2.1328 8.2966 4.0083 3.7232 7.3003 6.3819 5.6187 7.6252 1.9779 2.2537 1.2559 2.1874 1.3741 1.8221 2.4665 1.2948 4.9257 1.7955 3.4821 1.5338 1.7728 1.4458 2.4196 5.2676 3.1710 1.7514 2.2029 2.8206 2.0146 1.7105 1.9767 1.6688 1.2635 2.5657 1.4745 1.0647 5.5475 1.1458 1.4132 2.9848 1.5357 1.2624 1.2305 1.0687 1.3278 1.3881 1.4114 1.4204 1.6005 9.7860 1.2175 1.1933 2.2250 1.0876 1.0500 1.0509 1.0748 1.0683 1.0449 2.2494 1.0700 1.0869 6.4844 6.7516 8.1559 11.8570 1.0593 1.0597 1.0593 1.0362 1.0614 1.0974 1.0293 1.0996 1.1014 1.1043 1.1006 1.0994 1.1051 1.0847 1.0888 1.0934 1.1051 1.0973 1.0975 1.0649
irintensity: 0.3578 0.0540 0.0114 0.8944 0.8956 1.1595 1.3184 0.4953 0.0951 0.4136 2.7719 0.2227 0.2228 4.7253 6.0328 2.4292 4.2062 12.2113 80.1640 10.3560 5.4748 11.5341 3.7830 18.2154 19.3526 20.8740 1.2593 6.4066 5.4012 13.6976 0.0836 14.3223 19.9764 36.2577 73.9994 4.6967 23.1643 3.5785 2.8486 6.4588 0.7639 4.1079 11.4880 25.5238 9.8290 13.2987 0.7861 10.7927 10.8005 46.7259 21.7060 11.0531 6.1557 2.8224 1.1781 8.0004 1.3762 0.1417 58.9568 6.2881 2.4373 245.4102 8.4280 2.5179 26.8709 11.6991 0.3260 0.4897 0.4401 0.2356 11.5046 46.5457 21.6674 7.2795 0.2858 11.3396 19.2220 17.7036 9.7293 14.4953 9.7386 3.3500 0.1691 12.3969 17.7436 2.5278 16.8605 0.1673 61.8598 127.2900 36.1103 4.0806 21.5486 33.5514 33.2853 79.1165 2.8437 29.0699 14.1470 13.6811 75.6971 94.6767 54.9576 20.6063 0.0189 10.9665 30.2266 8.7252 21.9811 11.0879 41.9889
temp: 298.150 k
press: 1.00000 atm
elementType: 8 8 8 6 6 6 6 6 6 6 6 6 6 6 6 6 6 6 6 1 1 1 1 1 1 1 1 1 1 1 1 1 1 1 1 1 1 1 1
symmnumber: 1
zpe: 837495.9 jmol-1
zpe.correction: 0.318985 hartree
zpe.thermalcorrener: 0.340072 hartree
zpe.thermalcorrenthalpy: 0.341016 hartree
zpe.thermalcorrgfe: 0.265536 hartree
zpe.sumelectzpe: -845.875519 hartree
zpe.sumelectthermal: -845.854433 hartree
zpe.sumelectthermalent: -845.853489 hartree
zpe.sumelectthermalfe: -845.928968 hartree
dipole: 1.1822 -1.0825 3.3522
dipole: 3.7157
quadrupole: -105.2806 -104.0854 -111.8461
quadrupole: -4.9805 -6.2744 -2.0775
quadrupole: 1.7901 2.9853 -4.7754 -4.9805 -6.2744 -2.0775
hfenergy: -846.1945048 hartree
pointgroup: C01 [X(C16H20O3)]
dipole: 0.4767786 -0.4170625 1.317507 debye
polarizability: 200.6509432|-10.1937639|195.6907052|17.2923278|8.04965|141.8305435 unknown
InChI: InChI=1S/C16H20O3/c1-3-4-5-6-10-13-16(18,15(17)19-2)14-11-8-7-9-12-14/h7-9,11-12,18H,3-6H2,1-2H3
charge 0 multiplicity 1
39 atoms
O  -1.808051 -0.666843 -2.149036
O  -2.045816 -1.23158 1.464131
O  -3.162968 -2.155468 -0.356146
C  3.842042 -0.331689 -0.227574
C  3.486134 -1.739284 0.29741
C  4.86224 0.404305 0.670534
C  2.445217 -2.487825 -0.585971
C  -1.282603 -0.592981 -0.779461
C  -1.258634 0.891326 -0.363985
C  5.21547 1.812246 0.144513
C  1.131202 -1.822808 -0.637901
C  0.037214 -1.253464 -0.677626
C  -0.285148 1.38784 0.533139
C  -2.258799 1.75869 -0.863735
C  -2.277059 -1.406842 0.12303
C  -0.313466 2.742478 0.931867
C  -2.284465 3.113353 -0.465136
C  -1.314071 3.609893 0.435803
C  -2.919986 -2.007701 2.382988
H  2.918295 0.275567 -0.30967
H  4.250841 -0.414763 -1.256306
H  3.094887 -1.662574 1.331138
H  4.403436 -2.360056 0.346768
H  5.786296 -0.20439 0.752602
H  4.451117 0.484293 1.697972
H  2.315305 -3.521502 -0.207848
H  2.842658 -2.577575 -1.61738
H  4.312089 2.447485 0.07724
H  5.659752 1.757169 -0.867174
H  5.940623 2.322139 0.805143
H  0.488805 0.714671 0.916722
H  -2.986481 1.372373 -1.583248
H  0.445396 3.121059 1.626064
H  -3.056663 3.781729 -0.862502
H  -2.329549 -1.514624 -2.218353
H  -1.333732 4.661651 0.743285
H  -2.593644 -1.713173 3.389245
H  -2.77731 -3.08795 2.213739
H  -3.976177 -1.743475 2.210124
