program: Gaussian 09
title: 000272009
version: EM64L-G09RevD.01
frameworkgroup: C1[X(C20H29NO4)]
method: RPBEPBE
basis: SDD
operation: Freq
keyword: #p
keyword: freq=noraman
keyword: PBEPBE/SDD
title: #p freq=noraman PBEPBE/SDD
converged: YES YES NO NO
title: Mulliken charges:
elementType: O O O O N C C C C C C C C C C C C C C C C C C C C H H H H H H H H H H H H H H H H H H H H H H H H H H H H H
charge: -0.266972 -0.268978 -0.266052 -0.263452 -0.077128 0.408233 -0.479849 -0.482547 -0.413785 -0.407860 -0.611646 -0.627227 -0.476645 0.246912 0.249765 0.449571 -0.449060 -0.380044 -0.262478 -0.263412 -0.221878 -0.229690 -0.246648 -0.664298 -0.662873 0.207746 0.229698 0.223264 0.203839 0.180677 0.214567 0.233471 0.197389 0.303722 0.245565 0.301482 0.249939 0.191187 0.220874 0.231260 0.264916 0.232539 0.224179 0.234448 0.223342 0.223451 0.223665 0.226278 0.226981 0.215983 0.248295 0.216123 0.226695 0.246468
chargesum: 0.00000
title: Mulliken charges with hydrogens summed into heavy atoms:
elementType: O O O O N C C C C C C C C C C C C C C C C C C C C
charge: -0.266972 -0.268978 -0.266052 -0.263452 -0.077128 0.408233 -0.042405 -0.055444 -0.018541 0.023000 -0.062359 -0.075807 -0.064585 0.246912 0.249765 0.449571 -0.217799 -0.115128 0.194240 0.194378 0.001573 -0.006026 -0.020370 0.026961 0.026413
polarizability: 2.74374756e+02 -2.20471591e+01 2.24426848e+02 1.06141791e+01 1.65914092e+01 1.95462188e+02
1716.lowfreq: -19.9854 -13.2387 -6.0495 -5.3007 0.0002 0.0005 0.0007 13.5619 18.0272
frequency: -19.5712 13.4597 17.5221 28.0036 34.5782 39.7695 46.4241 67.5126 71.4981 84.2111 92.7514 109.6038 132.9846 147.0812 185.0734 194.4385 203.4937 222.9144 240.6686 249.5875 262.4302 264.1892 298.9037 313.4582 317.7611 329.0874 347.1123 364.0175 381.1073 405.7324 412.5341 419.9805 456.4244 471.5395 482.2738 519.0727 566.2794 570.4681 597.2231 615.0474 631.9927 668.8615 677.5383 705.1118 735.7339 741.8790 776.9473 786.7288 797.5660 806.8257 810.1681 817.5665 824.4336 860.0782 862.6701 872.1220 901.7505 913.7348 919.3904 950.7007 981.1482 982.6618 989.9202 991.1360 996.8905 1011.1979 1014.8199 1017.9023 1022.9953 1025.6869 1038.9771 1076.8712 1083.9089 1094.3920 1096.3201 1104.8813 1118.1468 1130.6682 1135.5608 1147.8279 1155.7896 1156.4819 1169.2128 1178.6747 1180.3610 1191.0640 1204.3129 1211.7098 1231.5481 1251.8498 1269.8600 1277.5870 1278.9105 1288.1475 1309.0063 1311.9007 1327.4512 1335.5463 1340.0227 1343.5869 1355.9880 1358.2996 1360.7650 1363.2113 1380.2730 1387.1821 1389.0650 1395.9908 1432.8460 1440.1741 1447.6663 1454.0308 1456.3207 1456.3683 1460.4471 1461.8455 1463.4915 1468.4817 1475.9975 1482.1545 1483.4635 1484.5390 1485.8970 1593.9810 1614.5076 1619.9531 1632.6572 2824.8712 2831.5114 2846.1680 2981.8109 2983.0011 2984.4200 2985.5910 2988.9268 2991.9822 2992.0613 3015.7613 3028.7104 3028.9847 3037.8039 3047.0627 3049.6244 3054.4366 3073.5801 3087.1102 3087.2695 3091.1501 3092.3472 3111.6892 3117.5580 3118.3545 3121.5330 3134.5632 3145.8133 3160.3132
redmass: 3.5427 4.0878 4.7104 3.5701 3.5972 4.4926 3.3827 5.2183 5.6979 4.1302 4.5224 3.8587 2.8364 2.9546 3.9396 1.8041 2.4202 1.4632 2.8543 2.0583 2.6733 2.8671 2.5598 2.3616 2.4554 3.4225 3.2387 2.0819 2.7607 2.8523 2.5098 3.3099 2.5471 2.6340 3.3283 3.4683 3.3742 3.8861 4.9049 5.6554 2.3110 4.2182 3.8813 2.2064 2.2685 2.1382 2.8191 1.9689 1.5411 2.1186 1.9738 1.9476 2.5524 1.2560 2.3927 3.4222 2.6814 1.4279 2.6193 1.9769 1.9740 1.4807 5.7118 2.0250 1.3947 1.9648 2.4725 2.7695 1.8400 2.0685 2.8722 1.5949 2.2414 2.2566 2.1543 2.7484 2.3136 2.9569 3.4030 2.2409 1.7019 1.6985 1.0637 1.1730 1.1154 2.2753 1.1436 2.5607 1.2688 1.5043 1.4700 1.1233 1.1270 1.4368 1.5110 1.4107 1.3866 1.3948 1.4388 1.4477 1.3577 1.4130 1.4823 1.5311 3.1261 1.2338 1.2326 1.8974 1.0970 2.0892 1.0939 1.0844 1.0916 1.0936 1.1193 1.0456 1.0429 1.0882 1.1497 1.8753 1.0618 1.0518 1.1188 6.1615 6.1290 8.4870 7.8081 1.0717 1.0721 1.0700 1.0759 1.0714 1.0633 1.0643 1.0618 1.0361 1.0359 1.0857 1.0593 1.0590 1.0871 1.0981 1.0993 1.1000 1.0922 1.0974 1.0974 1.1032 1.1032 1.0866 1.1062 1.1060 1.0863 1.0915 1.0955 1.1014
irintensity: 0.6428 0.7408 0.0928 0.0402 0.1324 0.1262 0.0735 1.6208 0.5527 1.7562 1.9134 0.6479 2.4152 4.6987 0.4018 0.2007 1.9787 7.7972 7.9270 0.0218 2.7714 6.8621 6.5305 30.4195 10.6380 3.2423 3.0614 5.2226 1.0122 0.2230 3.4716 8.8480 2.9246 6.7592 0.5240 1.1821 5.6046 1.9852 1.4653 0.4327 1.7087 6.6554 6.1056 32.7878 26.9208 27.4946 20.7505 16.8046 4.2255 3.9535 1.5343 3.7239 1.0970 0.3413 7.5538 1.6011 64.4103 3.8739 22.7858 1.4516 24.7964 3.9059 0.3704 16.5684 2.2971 11.4261 115.4569 39.7092 17.4110 7.2297 46.5547 17.8551 138.0490 99.8454 27.3981 281.3035 49.9871 61.5297 67.1497 14.9611 20.7541 8.0324 0.5604 21.7083 3.0231 44.5400 1.5905 4.7710 6.6307 46.6150 34.1842 4.9394 8.4285 29.1094 11.9775 23.0900 4.5727 49.2189 65.6113 23.7261 11.8258 16.6874 5.8560 8.6301 3.2442 21.9157 23.3464 2.0154 36.4408 10.2078 24.8372 6.3220 15.8334 12.1680 9.6961 11.8714 12.7368 31.9123 2.5107 12.0595 12.9048 12.1916 14.0225 0.9751 7.6599 12.4547 220.1008 43.2935 48.6917 186.4129 29.5600 6.6954 7.5948 43.9354 48.9201 22.5198 11.6714 59.7839 23.5323 44.9283 26.5644 7.5980 15.7686 35.0458 5.3805 28.3350 51.8999 1.2829 1.1097 8.3166 33.1955 34.4800 0.2971 19.7419 33.3924 28.9192
temp: 298.150 k
press: 1.00000 atm
elementType: 8 8 8 8 7 6 6 6 6 6 6 6 6 6 6 6 6 6 6 6 6 6 6 6 6 1 1 1 1 1 1 1 1 1 1 1 1 1 1 1 1 1 1 1 1 1 1 1 1 1 1 1 1 1
symmnumber: 1
zpe: 1197058.5 jmol-1
zpe.correction: 0.455936 hartree
zpe.thermalcorrener: 0.481181 hartree
zpe.thermalcorrenthalpy: 0.482125 hartree
zpe.thermalcorrgfe: 0.397194 hartree
zpe.sumelectzpe: -1133.255730 hartree
zpe.sumelectthermal: -1133.230485 hartree
zpe.sumelectthermalent: -1133.229540 hartree
zpe.sumelectthermalfe: -1133.314472 hartree
dipole: 0.1195 0.4086 0.4502
dipole: 0.6196
quadrupole: -141.4768 -133.8768 -152.5567
quadrupole: -9.7790 -0.6874 3.4183
quadrupole: 1.1599 8.7600 -9.9199 -9.7790 -0.6874 3.4183
hfenergy: -1133.7116656 hartree
pointgroup: C01 [X(C20H29N1O4)]
dipole: -0.0627005 -0.1470546 0.1840308 debye
polarizability: 270.5062269|-26.3362664|226.8812888|-9.8075151|-17.5190003|196.876276 unknown
InChI: InChI=1S/C20H29NO4/c1-3-24-18(22)14-20(15-19(23)25-4-2)10-12-21(13-11-20)16-17-8-6-5-7-9-17/h5-9H,3-4,10-16H2,1-2H3
charge 0 multiplicity 1
54 atoms
O  -4.120138 2.241944 -1.252682
O  -1.845364 -3.245756 0.916741
O  -3.831238 1.298597 0.855331
O  -2.429838 -2.212865 -1.086976
N  1.775641 0.703922 0.771025
C  -1.094444 0.317898 -0.010306
C  -0.602277 1.454239 0.941185
C  0.118735 -0.122277 -0.886646
C  0.693492 1.105074 1.701082
C  1.372698 -0.458111 -0.059021
C  -2.189917 0.86433 -0.972565
C  -1.641009 -0.863954 0.852091
C  3.065017 0.49086 1.467106
C  -3.425271 1.462722 -0.323039
C  -2.008215 -2.125503 0.093729
C  4.264496 0.457396 0.523231
C  5.362041 -0.398885 0.784883
C  4.321946 1.319057 -0.60145
C  -5.397976 2.866609 -0.787121
C  -2.215296 -4.572459 0.331024
C  6.501478 -0.390107 -0.05264
C  5.456119 1.327045 -1.442659
C  6.552618 0.474587 -1.169904
C  -5.12778 4.216304 -0.11601
C  -1.014645 -5.19609 -0.386273
H  -0.40844 2.356019 0.327037
H  -1.395477 1.707516 1.669018
H  -0.160034 -0.986495 -1.518519
H  0.379288 0.711216 -1.568357
H  0.490582 0.304599 2.460627
H  1.031155 1.995648 2.265126
H  2.20684 -0.704501 -0.740172
H  1.194748 -1.365795 0.575944
H  -2.531319 0.038964 -1.629039
H  -1.757083 1.634365 -1.637649
H  -2.553453 -0.509767 1.372748
H  -0.922301 -1.146684 1.638031
H  3.059765 -0.4440 2.086058
H  3.191846 1.333304 2.177868
H  5.324959 -1.077543 1.646794
H  3.460746 1.965305 -0.805154
H  -5.899105 2.16754 -0.094676
H  -5.985106 2.973665 -1.713204
H  -3.065054 -4.428489 -0.359053
H  -2.528551 -5.164661 1.205831
H  7.34286 -1.058825 0.16266
H  5.487323 1.996888 -2.309989
H  7.433171 0.481349 -1.822427
H  -4.578039 4.890943 -0.794861
H  -6.086103 4.699774 0.150657
H  -4.541186 4.081078 0.807944
H  -1.276432 -6.210515 -0.740707
H  -0.149688 -5.281135 0.294064
H  -0.723684 -4.590938 -1.261333
