program: Gaussian 09
title: 000271955
version: EM64L-G09RevD.01
frameworkgroup: C1[X(C18H13N3O3)]
method: RPBEPBE
basis: SDD
operation: Freq
keyword: #p
keyword: freq=noraman
keyword: PBEPBE/SDD
title: #p freq=noraman PBEPBE/SDD
converged: YES YES NO NO
title: Mulliken charges:
elementType: O O O N N N C C C C C C C C C C C C C C C C C C H H H H H H H H H H H H H
charge: -0.201105 -0.203658 -0.208420 -0.412401 0.068100 0.020827 0.191900 0.395748 0.154185 -0.397026 -0.429351 -0.382853 -0.423177 -0.238119 -0.248898 0.112860 -0.242990 0.484216 -0.509281 0.383098 -0.371617 -0.381816 -0.358939 -0.182469 0.270530 0.244618 0.271404 0.242477 0.237970 0.234439 0.235620 0.315662 0.282368 0.294409 0.218922 0.289006 0.243763
chargesum: 0.00000
title: Mulliken charges with hydrogens summed into heavy atoms:
elementType: O O O N N N C C C C C C C C C C C C C C C C C C
charge: -0.201105 -0.203658 -0.208420 -0.096739 0.068100 0.020827 0.191900 0.395748 0.154185 -0.126495 -0.184733 -0.111448 -0.180701 -0.000149 -0.014459 0.112860 -0.007371 0.484216 -0.226913 0.383098 -0.077209 -0.162894 -0.069933 0.061294
polarizability: 4.29874784e+02 -5.27952013e+00 2.54502846e+02 -2.81395800e+01 -5.06766288e-01 1.27532684e+02
1716.lowfreq: -9.3643 -2.8469 -0.0003 0.0006 0.0008 2.4757 19.3502 24.5996 29.3754
frequency: 19.2901 24.5430 29.3576 52.2559 65.6611 76.8681 109.5925 150.1099 155.3200 171.5908 179.2984 198.2406 236.8189 247.7795 271.9040 322.5516 331.9944 364.1487 380.1686 406.9002 425.4428 437.7628 452.3028 472.0237 506.4678 522.0328 530.9539 535.8086 564.5301 628.5676 640.5578 646.9626 656.5355 680.0679 688.3797 703.8674 717.5819 758.7256 771.2790 787.9677 789.4661 793.4908 828.0632 828.7964 867.4472 890.3544 909.9516 919.1264 938.4787 953.6885 962.3808 974.2854 986.1563 993.7614 1000.5506 1000.9599 1013.9560 1026.6923 1049.5994 1083.8824 1087.3571 1092.2064 1137.8833 1155.1280 1174.6876 1179.6048 1191.8861 1212.3614 1236.9644 1238.9820 1241.5885 1282.7489 1299.6907 1331.5718 1369.5731 1370.9579 1399.4968 1402.8378 1411.0892 1435.0247 1440.5799 1451.4744 1473.9703 1500.5675 1514.9556 1564.4530 1582.9161 1590.4924 1593.2613 1616.0789 1622.4539 1630.1608 2980.5966 3126.2548 3130.1543 3135.5607 3149.8191 3151.5248 3151.6679 3161.4303 3166.7909 3168.1912 3170.7184 3188.3074 3371.4208
redmass: 6.1363 5.9926 6.7442 10.1857 7.9391 5.8982 5.4960 6.3300 7.9648 5.3628 4.3054 5.6935 4.6694 2.8020 7.2101 5.4989 6.7680 6.1105 7.6589 3.9960 3.2493 6.1185 4.8287 3.3096 5.5562 6.6713 6.3322 4.7110 4.1912 3.9372 2.2403 3.3351 2.6315 7.6262 2.2668 5.6107 3.8023 1.4932 7.6324 4.4968 2.6678 3.5998 1.4584 1.6578 5.8102 1.6197 1.4398 4.2443 1.4164 1.6053 1.3878 1.3805 6.1846 1.5234 3.5279 1.4119 1.3672 2.9272 2.9507 1.8366 2.3883 1.7659 2.6835 1.4335 1.1506 1.1032 1.3743 4.7575 1.8556 2.1049 2.1681 1.9094 1.4566 1.6376 2.4624 10.6259 3.8428 3.1201 6.3792 3.5790 2.4107 2.3646 2.3096 2.0396 3.7492 6.5948 7.2145 5.8982 5.4309 6.8667 7.1428 6.7517 1.0875 1.0866 1.0876 1.0883 1.0917 1.0885 1.0941 1.0919 1.1005 1.0987 1.0948 1.0967 1.0759
irintensity: 1.4616 0.0668 1.5006 3.9221 4.3190 6.2029 1.8569 0.5850 1.3168 4.0408 2.5108 2.0813 2.8030 17.3682 0.5440 5.5519 4.1269 13.3320 1.8853 0.8943 0.1004 4.2141 8.2459 1.2399 5.5214 4.5035 0.1654 3.2324 9.0016 0.7627 30.9187 11.3691 50.7700 41.2514 31.1561 14.6545 6.0241 1.6286 5.1349 5.5811 38.0039 68.5719 19.6188 53.4027 10.4732 5.8404 1.0150 28.0776 1.8608 53.3447 0.1053 2.7677 0.7819 1.2062 1.3167 1.1640 1.9359 4.5084 5.6852 8.6551 69.4594 10.3546 305.6261 83.1329 20.6704 15.0655 108.8881 355.7443 3.9203 118.0748 64.9499 53.6271 2.6081 21.2988 4.7353 110.1127 6.4344 3.0407 0.1941 15.6762 1.9661 3.5891 144.1217 271.7548 14.4952 29.7220 23.0163 6.8200 1.3583 0.8298 156.0210 24.8819 46.3797 1.9754 3.0247 2.9427 8.4699 14.5059 26.1766 3.6963 30.6751 12.5441 5.7140 3.7921 1.1690
temp: 298.150 k
press: 1.00000 atm
elementType: 8 8 8 7 7 7 6 6 6 6 6 6 6 6 6 6 6 6 6 6 6 6 6 6 1 1 1 1 1 1 1 1 1 1 1 1 1
symmnumber: 1
zpe: 715479.0 jmol-1
zpe.correction: 0.272512 hartree
zpe.thermalcorrener: 0.292036 hartree
zpe.thermalcorrenthalpy: 0.292980 hartree
zpe.thermalcorrgfe: 0.221709 hartree
zpe.sumelectzpe: -1081.897640 hartree
zpe.sumelectthermal: -1081.878116 hartree
zpe.sumelectthermalent: -1081.877171 hartree
zpe.sumelectthermalfe: -1081.948443 hartree
dipole: 5.5733 1.3190 -0.6150
dipole: 5.7602
quadrupole: -149.0886 -140.4957 -138.8786
quadrupole: 27.9654 -17.7534 7.7995
quadrupole: -6.2676 2.3253 3.9424 27.9654 -17.7534 7.7995
hfenergy: -1082.1701518 hartree
pointgroup: C01 [X(C18H13N3O3)]
dipole: -2.2051668 -0.3556167 -0.3829287 debye
polarizability: 425.7127653|-19.4930126|254.3283406|39.249546|12.7237205|131.8692088 unknown
InChI: InChI=1S/C18H13N3O3/c22-18(17-10-4-7-14-6-1-2-9-16(14)17)20-19-12-13-5-3-8-15(11-13)21(23)24/h1-12,20H
charge 0 multiplicity 1
37 atoms
O  -1.459542 2.670054 0.932736
O  7.453201 -1.388407 -0.149592
O  5.772799 -2.533946 -1.180859
N  -0.713829 0.661791 -0.032745
N  0.601117 0.873106 0.309131
N  6.210828 -1.557602 -0.456615
C  -3.658922 -0.133239 0.010906
C  -4.972602 -0.381992 -0.558325
C  -3.102889 1.198873 -0.107548
C  -3.012021 -1.211418 0.710459
C  -5.693622 0.691171 -1.176947
C  -3.864333 2.230424 -0.6789
C  -5.544154 -1.694612 -0.467293
C  -5.159709 1.980312 -1.217109
C  -3.601744 -2.475788 0.792026
C  -1.717637 1.587414 0.34788
C  -4.870481 -2.728705 0.183426
C  2.916683 0.191699 0.205811
C  3.865605 -0.743803 -0.275763
C  5.225105 -0.571181 0.053389
C  3.36153 1.283154 1.010491
C  1.498498 0.018091 -0.136339
C  5.68064 0.502396 0.847762
C  4.726593 1.430579 1.323552
H  -2.065963 -1.029986 1.230726
H  -6.682031 0.484932 -1.604321
H  -3.434852 3.236791 -0.715607
H  -6.532575 -1.868302 -0.909064
H  -5.723329 2.801284 -1.671695
H  -3.096164 -3.277518 1.341272
H  -5.317303 -3.726221 0.250203
H  -0.988509 -0.144468 -0.616362
H  3.571404 -1.596031 -0.89656
H  2.615618 1.997567 1.372607
H  1.236303 -0.850007 -0.774204
H  6.745866 0.592832 1.074946
H  5.055025 2.272556 1.941022
