program: Gaussian 09
title: 000272024
version: EM64L-G09RevD.01
frameworkgroup: C1[X(C15H16O5)]
method: RPBEPBE
basis: SDD
operation: Freq
keyword: #pfreq=noraman
keyword: PBEPBE/SDD
title: #p freq=noraman PBEPBE/SDD
converged: YES YES NO NO
title: Mulliken charges:
elementType: O O O O O C C C C C C C C C C C C C C C H H H H H H H H H H H H H H H H
charge: -0.232402 -0.392027 -0.201427 -0.187539 -0.226196 0.227244 -0.406998 -0.329865 -0.214852 -0.111381 -0.534280 -0.418832 0.433042 0.393100 -0.046391 0.081177 0.129836 -0.707042 -0.689729 -0.581684 0.243036 0.264304 0.295843 0.246743 0.234954 0.245115 0.236133 0.266967 0.231886 0.323513 0.222262 0.268197 0.246385 0.260050 0.220632 0.210229
chargesum: 0.00000
title: Mulliken charges with hydrogens summed into heavy atoms:
elementType: O O O O O C C C C C C C C C C C C C C C
charge: -0.232402 -0.068515 -0.201427 -0.187539 -0.226196 0.227244 -0.163962 -0.065561 0.080991 0.135362 -0.054211 0.084268 0.433042 0.393100 0.185495 0.081177 0.129836 -0.216583 -0.183295 -0.150823
polarizability: 1.90361105e+02 5.53110068e+00 1.81660581e+02 -1.17147330e+01 1.07593503e+01 1.38691549e+02
1716.lowfreq: -50.7759 -16.5660 -5.4395 -0.0007 -0.0005 -0.0004 10.9837 42.3015 54.9836
frequency: -50.7626 42.2768 54.9095 56.7733 87.9473 113.7474 119.4064 150.6055 174.1363 192.5091 226.5978 259.0490 269.6875 280.9556 303.2787 315.8512 335.7548 346.6231 382.4073 395.2972 404.4093 414.4643 428.8721 501.9051 524.8899 542.7016 561.6228 594.6069 607.3077 625.2167 643.8428 661.3887 694.1626 702.6770 746.9990 773.8576 781.2124 781.8664 809.9568 836.0105 869.2076 911.3553 931.8657 948.2771 948.6141 953.8984 977.1101 986.4685 991.7743 993.5241 995.9087 1002.4045 1023.2689 1044.8016 1054.4925 1076.1157 1086.5584 1112.3425 1151.4721 1162.1209 1172.7495 1204.4261 1228.0606 1246.6648 1253.9926 1260.1113 1280.0728 1289.4276 1305.9853 1322.1930 1324.5268 1334.8499 1345.4417 1359.8044 1365.7484 1371.5717 1415.1218 1421.1172 1425.3217 1445.4489 1482.5658 1623.0343 1649.9487 1658.0160 1674.9257 1695.9445 2949.0856 2989.3006 3004.7604 3022.6226 3032.9069 3052.7478 3055.6497 3086.1968 3095.8368 3097.1842 3098.8437 3104.6477 3195.1384 3211.7443 3217.8581 3528.9756
redmass: 2.1523 5.5791 4.6606 9.2795 5.6087 5.2698 5.2226 4.7421 4.7578 3.6944 4.3285 1.6939 1.6773 2.2552 2.2309 4.0934 4.3351 4.2183 4.9612 5.0133 3.7897 4.9341 4.4056 3.0690 4.0065 3.5302 4.5346 5.9795 3.9074 4.1452 1.8652 2.1704 3.0187 2.9495 3.3477 2.1345 3.5110 2.6845 3.2544 3.9688 2.5108 2.4713 2.8186 1.7266 2.0072 2.5328 3.5576 1.5639 1.3947 1.2746 1.8529 2.0946 3.3794 2.0607 3.0035 4.6179 3.2378 2.0434 2.0917 1.7732 1.4399 1.4850 1.6454 1.9219 2.1720 1.5817 1.8803 1.8442 1.2652 1.3837 1.3688 1.3441 1.4868 1.3429 1.3435 1.1911 1.1967 1.1718 1.2019 1.0811 1.0844 9.5989 4.4867 6.5041 6.7866 11.5991 1.0835 1.0697 1.0786 1.0852 1.0593 1.0974 1.0882 1.0638 1.1064 1.0920 1.0627 1.0623 1.1132 1.1147 1.1155 1.0659
irintensity: 0.2181 3.6051 3.9861 3.1701 1.5298 0.6311 1.1837 2.3852 0.7729 2.0503 1.8613 35.9932 53.6715 16.5293 5.5627 2.8820 22.3959 11.4888 0.4872 0.7908 7.5336 2.2607 3.6162 1.7663 1.2245 2.0236 1.2058 2.4797 5.8567 1.7549 17.3270 4.9456 7.2013 8.9712 3.0749 8.4371 4.2857 14.6330 1.1230 63.7266 21.3969 8.3416 22.3828 43.0109 52.4652 39.0992 48.1884 12.0365 49.5710 35.9907 79.1111 22.0326 130.3012 15.9365 8.6665 265.3754 25.3781 13.2111 11.0360 37.9031 8.2517 9.0782 17.3068 47.2470 25.5891 5.0199 21.5857 28.3139 1.1792 1.7197 18.4842 7.3250 12.2207 12.9454 6.1047 12.2467 28.3735 24.5242 12.6219 13.2102 17.6630 190.0299 11.2437 64.7340 35.1841 256.4785 22.6393 3.2990 37.1644 24.5339 14.4469 1.9571 23.0248 10.8572 18.1749 3.5730 8.3599 1.8624 18.1161 2.6843 1.6927 5.9868
temp: 298.150 k
press: 1.00000 atm
elementType: 8 8 8 8 8 6 6 6 6 6 6 6 6 6 6 6 6 6 6 6 1 1 1 1 1 1 1 1 1 1 1 1 1 1 1 1
symmnumber: 1
zpe: 734913.4 jmol-1
zpe.correction: 0.279914 hartree
zpe.thermalcorrener: 0.297433 hartree
zpe.thermalcorrenthalpy: 0.298377 hartree
zpe.thermalcorrgfe: 0.235105 hartree
zpe.sumelectzpe: -955.767490 hartree
zpe.sumelectthermal: -955.749970 hartree
zpe.sumelectthermalent: -955.749026 hartree
zpe.sumelectthermalfe: -955.812299 hartree
dipole: -0.6404 1.1582 -9.1224
dipole: 9.2179
quadrupole: -134.5692 -115.3074 -121.6533
quadrupole: 12.4261 -1.5503 5.8360
quadrupole: -10.7260 8.5359 2.1900 12.4261 -1.5503 5.8360
hfenergy: -956.0474033 hartree
pointgroup: C01 [X(C15H16O5)]
dipole: 0.3114853 -0.690604 -3.5465776 debye
polarizability: 189.8725548|6.6077486|180.1850908|12.1950966|-13.2934515|140.6555888 unknown
InChI: InChI=1S/C15H16O5/c1-4-15-5-9-10(7(2)14(18)20-9)12(16)11(15)8(3)13(17)19-6-15/h4,9-12,16H,1-3,5-6H2
charge 0 multiplicity 1
36 atoms
O  2.192609 -1.461311 0.613902
O  0.559903 2.415651 -1.074024
O  -1.930868 -0.116715 1.765711
O  3.878809 -0.405897 1.841316
O  -3.314388 1.683747 1.647139
C  -0.956049 -1.100143 -0.370291
C  -0.873173 0.366499 -0.909708
C  1.721873 0.241505 -1.037074
C  0.479368 1.049327 -0.541928
C  1.631497 -1.286493 -0.7748
C  0.252018 -1.935114 -0.890664
C  -0.930354 -1.047804 1.178463
C  -2.047461 1.17142 -0.371845
C  2.95194 0.621912 -0.228588
C  -2.259447 -1.747857 -0.86592
C  3.122481 -0.403053 0.857458
C  -2.479941 0.964966 1.058944
C  -2.724644 2.090417 -1.1082
C  3.763082 1.700466 -0.34556
C  -2.646056 -3.02082 -0.612004
H  -0.940058 0.339905 -2.019721
H  1.84525 0.435512 -2.11876
H  0.539213 1.206064 0.548782
H  2.335997 -1.815323 -1.445728
H  0.074415 -2.146344 -1.96313
H  0.281126 -2.91914 -0.386801
H  -1.189517 -2.030639 1.60478
H  0.058472 -0.752957 1.567855
H  -2.911321 -1.110809 -1.481623
H  0.395385 2.387131 -2.052581
H  -2.475707 2.284205 -2.15797
H  -3.540008 2.666558 -0.658322
H  3.609116 2.459207 -1.118601
H  4.591344 1.839979 0.358912
H  -3.587323 -3.415582 -1.008499
H  -2.055985 -3.70977 0.00628
