program: Gaussian 09
title: 000271952
version: EM64L-G09RevD.01
frameworkgroup: C1[X(C19H14N2O3)]
method: RPBEPBE
basis: SDD
operation: Freq
keyword: #p
keyword: freq=noraman
keyword: PBEPBE/SDD
title: #p freq=noraman PBEPBE/SDD
converged: YES YES NO NO
title: Mulliken charges:
elementType: O O O N N C C C C C C C C C C C C C C C C C C C H H H H H H H H H H H H H H
charge: -0.261752 -0.258631 -0.208736 -0.408884 0.056682 0.189591 0.396912 0.150440 0.220658 0.173783 -0.397248 -0.432828 0.504403 -0.384985 -0.425271 -0.484443 -0.238820 -0.330300 -0.391600 0.110151 -0.202255 -0.251501 -0.244558 -0.393866 0.273046 0.242316 0.270814 0.305099 0.240410 0.235331 0.253105 0.228127 0.240575 0.240304 0.232100 0.232821 0.210607 0.308402
chargesum: 0.00000
title: Mulliken charges with hydrogens summed into heavy atoms:
elementType: O O O N N C C C C C C C C C C C C C C C C C C C
charge: -0.261752 -0.258631 -0.208736 -0.100482 0.056682 0.189591 0.396912 0.150440 0.220658 0.173783 -0.124201 -0.190512 0.504403 -0.114171 -0.184861 -0.179344 -0.003489 -0.077195 -0.163473 0.110151 0.278625 -0.019401 -0.011738 -0.183258
polarizability: 4.54852028e+02 1.09956866e+01 2.46078968e+02 -1.69805587e+01 1.45036359e+00 1.27773646e+02
1716.lowfreq: -7.3355 -1.7693 -0.0006 0.0002 0.0005 2.9242 14.3957 22.5589 28.9615
frequency: 11.5905 22.4504 28.9399 32.5607 61.6168 69.0175 95.9991 145.4623 175.3259 182.9638 208.2896 214.7667 219.2527 233.4946 291.3876 327.1961 346.9754 370.5997 379.5238 406.8388 437.9167 443.8790 471.9347 477.8835 507.5858 524.6750 544.1401 583.4114 609.6527 614.5857 636.6286 644.8629 655.1763 680.7208 715.3879 723.5291 757.2564 761.5082 783.9027 788.6395 789.4931 799.7429 808.0179 827.7040 841.8405 880.2444 889.3824 907.3895 924.1949 935.0526 938.2232 944.0276 972.4546 979.4532 992.4129 999.0086 1002.0871 1025.2526 1043.7797 1062.0977 1066.4528 1080.8204 1119.9888 1127.2550 1143.4888 1155.5683 1177.9067 1190.2134 1198.7567 1236.1642 1239.9545 1255.2862 1263.3282 1282.1196 1335.0007 1365.6285 1368.7874 1393.6788 1401.2233 1411.7126 1439.1235 1451.8570 1456.5996 1472.8616 1487.8034 1504.5451 1514.7702 1569.0849 1584.8833 1591.9870 1607.1047 1618.0206 1624.2977 1629.8656 2966.1173 3016.0228 3094.8757 3124.2223 3127.2647 3135.1330 3136.2894 3148.2825 3151.5347 3165.8824 3166.9131 3183.7359 3187.2275 3370.5756
redmass: 3.8551 2.9526 5.7511 6.0376 7.9165 6.4878 6.3526 5.5097 5.2073 5.4577 5.7719 4.1246 6.1326 4.6628 5.0939 8.1799 5.6706 4.9780 6.4431 3.9675 3.2043 4.0562 3.3261 5.6176 5.7719 6.8593 4.8327 4.8083 3.5101 5.3405 1.9532 2.5805 4.0217 9.6291 3.7574 4.3903 1.5883 5.1843 5.9755 4.4330 2.1394 4.8399 1.3564 1.6863 10.5615 6.0627 1.6352 1.3510 1.3947 1.8962 2.2553 1.5315 1.3872 4.8996 1.4440 1.3368 4.2898 3.1024 3.1725 3.9696 1.4542 2.5017 1.0370 1.7395 1.7371 1.4243 1.1078 1.4276 1.7393 1.9131 1.9342 1.7957 2.0066 1.9186 1.8044 1.2850 2.4794 3.6670 2.6995 6.2820 2.4563 2.4129 4.3081 2.3563 1.2238 2.1260 3.7905 6.5363 7.3520 5.4081 7.6005 7.3211 7.6503 6.6704 1.0869 1.0534 1.1190 1.0866 1.0874 1.0884 1.0899 1.0918 1.0943 1.1001 1.0987 1.0951 1.0942 1.0758
irintensity: 9.3593 6.4551 0.3316 1.2124 4.7114 2.4412 3.0075 0.3885 3.3313 2.3793 2.4450 5.0238 0.4217 4.6786 10.5261 2.8629 17.2033 3.7552 10.5333 1.8040 2.6965 13.7835 0.7758 2.4987 7.1236 2.4762 6.1733 6.9740 2.2881 7.5945 53.1419 17.3550 36.2323 0.3286 4.4193 4.1726 4.8992 13.3115 0.6570 6.6573 59.2128 46.3774 35.9641 40.3567 22.1506 29.8050 5.7790 0.7098 31.6914 1.2086 0.0758 28.7123 1.9275 174.4971 5.0467 1.0021 16.0773 7.5562 6.6366 6.3192 4.3073 90.4211 0.0091 139.1197 60.7305 68.9710 17.8218 102.2648 26.5734 5.7496 161.5948 168.2567 179.6326 44.1107 21.7397 0.4375 5.0262 45.4030 1.8201 0.5626 2.6484 5.9708 103.4050 272.7283 23.7412 193.2578 12.6216 35.7082 13.0631 6.2544 0.0840 188.5995 15.9778 10.8513 58.9810 149.5298 30.3677 1.2419 3.6949 5.3130 9.7572 12.8528 33.1523 36.1225 9.0961 4.5561 6.7564 7.7418
temp: 298.150 k
press: 1.00000 atm
elementType: 8 8 8 7 7 6 6 6 6 6 6 6 6 6 6 6 6 6 6 6 6 6 6 6 1 1 1 1 1 1 1 1 1 1 1 1 1 1
symmnumber: 1
zpe: 748202.0 jmol-1
zpe.correction: 0.284975 hartree
zpe.thermalcorrener: 0.304440 hartree
zpe.thermalcorrenthalpy: 0.305384 hartree
zpe.thermalcorrgfe: 0.233334 hartree
zpe.sumelectzpe: -1065.902735 hartree
zpe.sumelectthermal: -1065.883270 hartree
zpe.sumelectthermalent: -1065.882326 hartree
zpe.sumelectthermalfe: -1065.954376 hartree
dipole: -0.8368 4.2783 2.4527
dipole: 5.0019
quadrupole: -99.7463 -135.2972 -140.1162
quadrupole: -5.5461 -8.1247 -5.0530
quadrupole: 25.3069 -10.2440 -15.0630 -5.5461 -8.1247 -5.0530
hfenergy: -1066.1877099 hartree
pointgroup: C01 [X(C19H14N2O3)]
dipole: -0.327677 1.0364823 1.6404344 debye
polarizability: 453.2428802|24.7410726|220.6673854|-16.6402294|48.638917|154.7943769 unknown
InChI: InChI=1S/C19H14N2O3/c22-19(16-7-3-5-14-4-1-2-6-15(14)16)21-20-11-13-8-9-17-18(10-13)24-12-23-17/h1-11,21H,12H2
charge 0 multiplicity 1
38 atoms
O  5.795941 -0.602734 -1.535699
O  7.025302 0.523261 0.194666
O  -1.088593 -1.844725 -1.801168
N  -0.683699 -0.470214 0.062095
N  0.683223 -0.422032 -0.138569
C  -3.686747 0.087084 -0.062745
C  -5.076367 -0.026697 0.347949
C  -2.986169 -1.117882 -0.454888
C  4.914693 -0.136716 -0.528596
C  5.644273 0.526865 0.488797
C  -3.103116 1.401548 -0.110076
C  -5.723252 -1.3052 0.318146
C  2.862067 0.287651 0.65036
C  -3.672817 -2.34035 -0.513581
C  -5.791559 1.149733 0.751404
C  3.53364 -0.276236 -0.484721
C  -5.040625 -2.43908 -0.125511
C  5.012891 1.084527 1.602811
C  3.601293 0.953252 1.667711
C  -1.52255 -1.170405 -0.8304
C  7.158128 -0.207088 -1.099114
C  -3.831556 2.529335 0.277264
C  -5.182443 2.404671 0.729482
C  1.406599 0.184479 0.782191
H  -2.087965 1.528165 -0.499784
H  -6.770714 -1.374138 0.634917
H  -3.129667 -3.226465 -0.857518
H  2.961104 -0.787538 -1.262016
H  -6.83662 1.045613 1.066762
H  -5.544804 -3.410041 -0.16695
H  5.581319 1.594707 2.383898
H  3.068572 1.376295 2.52727
H  7.595504 0.47416 -1.848655
H  7.764176 -1.114478 -0.934475
H  -3.370175 3.52132 0.219501
H  -5.738798 3.296939 1.035736
H  0.956355 0.635854 1.690574
H  -1.110044 -0.042238 0.899336
