program: Gaussian 09
title: 000271959
version: EM64L-G09RevD.01
frameworkgroup: C1[X(C22H19N3O)]
method: RPBEPBE
basis: SDD
operation: Freq
keyword: #p
keyword: freq=noraman
keyword: PBEPBE/SDD
title: #p freq=noraman PBEPBE/SDD
converged: YES YES NO NO
title: Mulliken charges:
elementType: O N N N C C C C C C C C C C C C C C C C C C C C C C H H H H H H H H H H H H H H H H H H H
charge: -0.291137 -0.055344 -0.438099 0.013182 0.313886 0.235985 0.226646 -0.093073 -0.094196 -0.334243 -0.315479 -0.312781 -0.322041 -0.290445 -0.286797 -0.236598 -0.233023 0.277324 0.239336 -0.397875 -0.342650 -0.355252 -0.248816 -0.232584 -0.241844 -0.685537 0.184572 0.289973 0.266468 0.264528 0.281568 0.226568 0.224006 0.231524 0.228524 0.243230 0.256503 0.245817 0.230527 0.227842 0.212588 0.212131 0.212686 0.230571 0.231829
chargesum: 0.00000
title: Mulliken charges with hydrogens summed into heavy atoms:
elementType: O N N N C C C C C C C C C C C C C C C C C C C C C C
charge: -0.291137 -0.055344 -0.156531 0.013182 0.313886 0.235985 0.226646 -0.093073 -0.094196 -0.149671 -0.025506 -0.046313 -0.057514 -0.063878 -0.062792 -0.005074 -0.004499 0.277324 0.239336 -0.154646 -0.086148 -0.109434 -0.018289 -0.004741 0.182876 -0.010450
polarizability: 5.37328104e+02 -3.49894642e+01 3.90835511e+02 -5.07661326e+00 -4.34066060e+00 1.11532725e+02
1716.lowfreq: -5.9837 -0.0007 -0.0005 -0.0003 2.2826 3.8725 10.3188 27.6299 33.9185
frequency: 9.7743 27.5254 33.9145 54.3750 68.8879 93.5740 96.4043 99.5703 123.2110 142.0370 160.4322 190.3938 203.5578 217.6894 247.1341 252.1615 265.1307 309.3340 312.0576 322.6140 355.4421 385.3500 405.3273 414.7009 435.0170 469.4870 478.3629 501.4685 506.7473 536.6021 542.6909 574.0028 592.3732 598.9026 619.8425 631.9122 640.6712 649.2410 655.8138 697.9875 740.4350 745.4563 752.2010 756.0700 766.2065 779.8736 799.1316 826.3334 829.9933 858.1269 859.5653 862.1138 884.0275 887.0348 907.6431 924.2928 935.6211 945.0987 947.2332 980.5524 983.5977 990.5202 1001.5989 1021.6904 1028.8427 1035.2477 1044.4160 1067.6183 1096.0692 1107.5717 1116.5629 1134.0214 1136.5621 1158.1448 1168.9983 1173.2798 1189.6079 1204.3257 1226.9985 1235.9817 1252.5590 1265.2694 1283.7559 1293.0366 1296.4861 1325.0126 1348.4771 1367.6095 1376.7084 1391.0908 1400.1462 1401.6716 1423.8289 1439.7383 1441.3887 1450.4211 1463.1521 1467.8003 1474.6982 1481.2794 1492.2760 1523.1308 1530.8829 1545.9972 1552.9592 1572.6000 1587.7336 1604.9720 1612.0519 1629.2082 2960.2858 2996.9810 3019.9488 3021.7680 3094.6660 3097.6841 3105.4187 3128.5967 3134.7795 3134.9613 3146.9686 3150.5537 3153.2141 3165.8615 3168.2633 3170.6267 3175.3031 3195.6801 3399.4226
redmass: 4.7071 4.9099 4.9143 4.1294 3.5588 4.3243 3.6081 3.3791 2.3082 4.1273 4.1726 4.2762 4.2486 4.1948 3.9020 1.2772 4.8014 5.6556 4.5460 3.9099 4.5914 6.5629 4.2013 4.3317 6.0719 2.8222 3.1188 5.9443 3.3835 6.4794 3.4423 3.2905 6.5291 7.0746 2.4184 6.0498 5.4822 4.7698 2.2344 5.7459 3.5109 3.3798 1.4349 1.2776 4.4426 1.3740 2.8302 1.1174 6.1303 1.7908 1.6382 3.1537 5.1019 1.6303 3.4828 6.5986 1.4575 1.3702 1.4284 1.3405 1.3437 1.3278 1.3129 2.2984 2.1429 2.7336 2.1624 4.5131 2.6331 2.1374 2.1724 1.7828 1.4406 1.2198 1.4121 1.0988 1.4794 2.3066 1.4833 2.1655 2.7926 1.1378 1.6939 3.7825 1.5548 2.0772 2.5111 1.5494 2.3461 3.4314 1.3868 3.3483 4.9928 2.4883 2.4558 2.7119 1.0401 2.0933 1.9771 1.2460 1.1864 5.8561 5.1786 5.5661 7.5907 2.3316 5.0891 6.3246 4.9884 6.4114 1.0555 1.0362 1.1077 1.0872 1.0989 1.0870 1.1016 1.0863 1.0856 1.0877 1.0916 1.0899 1.0938 1.0940 1.0979 1.0994 1.0991 1.0938 1.0731
irintensity: 0.0536 0.1492 0.0770 0.9189 0.2188 0.8681 2.0241 0.1479 5.5461 5.6320 7.8515 3.7482 11.1058 0.5346 1.2108 0.2904 4.1085 0.7714 10.3410 0.9856 3.4084 1.0351 4.5587 3.2515 1.0068 1.1409 5.5170 14.5278 0.0697 19.6827 0.3149 3.2035 13.8921 0.5052 6.8245 14.9201 15.4142 8.9478 53.5345 2.5081 0.2876 7.0736 95.0310 73.4122 11.8736 100.5298 0.2020 1.4823 2.4238 4.6650 0.8731 1.8339 1.8133 1.1631 47.5951 0.5282 15.3641 0.2396 16.0559 0.0969 4.0107 0.6471 0.6268 6.3855 10.9281 80.5449 9.1882 52.7097 82.5333 2.6769 32.1277 76.6828 4.8624 0.1112 18.3471 37.4028 37.6911 59.8943 27.6892 215.7329 3.8878 0.0115 0.5195 21.1628 0.7493 45.0284 70.8862 26.2908 151.9645 1.7936 27.0555 54.1144 207.0710 21.2549 58.1118 1.9971 12.8557 51.3306 11.6325 6.3181 1.3737 138.3976 84.9015 125.1287 101.8934 75.6726 29.8622 30.6847 29.5688 11.4131 62.0818 21.0419 31.3036 37.4462 34.8829 11.6315 34.7307 13.0346 0.2918 12.9801 18.3969 11.6988 20.6818 22.2214 27.1533 33.6859 27.4332 23.6435 0.5014
temp: 298.150 k
press: 1.00000 atm
elementType: 8 7 7 7 6 6 6 6 6 6 6 6 6 6 6 6 6 6 6 6 6 6 6 6 6 6 1 1 1 1 1 1 1 1 1 1 1 1 1 1 1 1 1 1 1
symmnumber: 1
zpe: 931575.8 jmol-1
zpe.correction: 0.354818 hartree
zpe.thermalcorrener: 0.376713 hartree
zpe.thermalcorrenthalpy: 0.377657 hartree
zpe.thermalcorrgfe: 0.301602 hartree
zpe.sumelectzpe: -1087.395979 hartree
zpe.sumelectthermal: -1087.374085 hartree
zpe.sumelectthermalent: -1087.373141 hartree
zpe.sumelectthermalfe: -1087.449196 hartree
dipole: 6.5924 2.8268 0.1302
dipole: 7.1741
quadrupole: -133.6891 -126.7154 -160.5535
quadrupole: 3.5177 1.4743 0.1916
quadrupole: 6.6302 13.6040 -20.2342 3.5177 1.4743 0.1916
hfenergy: -1087.7507979 hartree
pointgroup: C01 [X(C22H19N3O1)]
dipole: -2.6518725 0.4481398 -0.8563656 debye
polarizability: 529.7968322|51.6405978|256.6403875|-11.9679988|-141.6722733|253.2591203 unknown
InChI: InChI=1S/C22H19N3O/c1-2-26-21-14-8-3-9-16(21)15-23-25-22-17-10-4-6-12-19(17)24-20-13-7-5-11-18(20)22/h3-15,25H,2H2,1H3
charge 0 multiplicity 1
45 atoms
O  -4.443801 0.208321 -1.199426
N  4.580733 0.104584 0.116861
N  0.324517 0.260931 -0.434888
N  -0.675432 -0.394416 0.252928
C  1.695126 0.178695 -0.175295
C  2.538237 1.097755 -0.908677
C  2.306204 -0.75758 0.731308
C  3.980028 0.996286 -0.731154
C  3.766619 -0.734772 0.83287
C  2.041891 2.115193 -1.798473
C  1.59084 -1.721089 1.52956
C  4.842888 1.878401 -1.473041
C  4.421501 -1.654767 1.725667
C  2.90526 2.958158 -2.49727
C  2.26443 -2.598667 2.377149
C  4.325101 2.834036 -2.340398
C  3.693969 -2.565569 2.483228
C  -3.058204 -0.808556 0.479128
C  -4.372774 -0.600834 -0.053683
C  -1.910339 -0.186424 -0.176777
C  -2.924465 -1.618782 1.640532
C  -5.501968 -1.191377 0.561468
C  -4.045424 -2.20835 2.254411
C  -5.334673 -1.993502 1.71201
C  -5.770533 0.454201 -1.801576
C  -5.546486 1.348241 -3.017801
H  0.965285 2.280358 -1.934484
H  0.503584 -1.744347 1.458904
H  5.918644 1.758506 -1.312466
H  5.513261 -1.597346 1.770522
H  0.043393 0.876921 -1.210175
H  2.496759 3.727059 -3.161986
H  1.694133 -3.322083 2.970597
H  4.993961 3.499632 -2.89671
H  4.207833 -3.259307 3.158092
H  -2.127332 0.46093 -1.045874
H  -1.920495 -1.766218 2.050497
H  -6.505677 -1.035524 0.156711
H  -3.92032 -2.827265 3.148645
H  -6.21337 -2.447325 2.183263
H  -6.225535 -0.514712 -2.091733
H  -6.426369 0.945891 -1.054499
H  -6.511722 1.562718 -3.511233
H  -5.087354 2.306364 -2.720017
H  -4.883725 0.854533 -3.748817
