program: Gaussian 09
title: 000272114
version: EM64L-G09RevD.01
frameworkgroup: C1[X(C17H20N6O6)]
method: RPBEPBE
basis: SDD
operation: Freq
keyword: #p
keyword: freq=noraman
keyword: PBEPBE/SDD
title: #p freq=noraman PBEPBE/SDD
converged: NO YES NO NO
title: Mulliken charges:
elementType: O O O O O O N N N N N N C C C C C C C C C C C C C C C C C H H H H H H H H H H H H H H H H H H H H
charge: -0.172780 -0.294097 -0.181016 -0.268213 -0.298343 -0.164469 -0.124710 -0.402275 -0.476776 -0.034376 0.049581 -0.620622 -0.481738 -0.496407 0.445156 0.190579 -0.516583 -0.665312 -0.358142 -0.339434 0.442899 -0.347063 -0.384308 0.245260 0.001874 0.172949 0.024076 0.165067 -0.500442 0.238597 0.274187 0.257162 0.248494 0.254847 0.253780 0.236417 0.247816 0.239237 0.422629 0.243285 0.214655 0.269396 0.263741 0.339642 0.361614 0.313034 0.239726 0.241533 0.229878
chargesum: 0.00000
title: Mulliken charges with hydrogens summed into heavy atoms:
elementType: O O O O O O N N N N N N C C C C C C C C C C C C C C C C C
charge: -0.172780 -0.294097 -0.181016 -0.268213 -0.298343 -0.164469 -0.124710 0.020354 -0.137134 -0.034376 0.049581 0.054027 0.031046 0.009249 0.445156 0.190579 -0.007956 0.058158 -0.114857 -0.124779 0.442899 -0.077667 -0.120568 0.245260 0.001874 0.172949 0.024076 0.165067 0.210694
polarizability: 4.06961390e+02 4.89877476e+01 3.14302360e+02 -2.93981446e+01 -7.90333662e-01 1.36515388e+02
1716.lowfreq: -7.8306 -3.0882 0.0004 0.0009 0.0010 1.7006 5.8794 10.5957 15.2157
frequency: 4.3401 10.4477 14.9784 29.5570 40.0128 48.1837 59.1005 67.8877 70.2787 77.2612 88.5747 101.7121 118.8459 121.9917 135.5426 149.0670 163.8440 171.2865 196.3496 208.7354 216.2133 225.0205 245.9877 260.3717 264.2309 275.4779 279.6093 294.2950 314.7236 336.5109 369.8149 382.0007 416.7204 420.2474 428.6580 455.7096 464.5175 496.5311 503.9010 512.2435 518.2994 528.9490 557.1611 577.3413 607.1409 628.7378 632.0555 638.8733 641.6296 666.0498 677.2861 690.1051 703.7940 733.7291 756.0010 758.3670 764.1619 780.3158 787.5526 810.0881 834.1479 859.3462 902.2513 914.3186 923.5428 945.4801 956.7563 975.2797 982.1978 985.8494 997.4189 1000.2324 1015.8764 1057.3301 1070.3120 1071.7068 1102.2868 1109.6368 1113.8640 1129.7371 1136.7702 1143.5118 1147.1285 1189.1318 1193.9501 1194.8617 1213.0098 1219.2569 1245.4453 1268.4352 1274.0402 1284.9289 1294.6280 1316.3284 1331.8518 1334.5975 1348.3621 1373.9834 1382.6550 1389.3132 1424.1474 1432.6395 1439.4785 1448.3948 1450.0793 1451.3019 1457.1614 1465.0504 1475.3046 1480.4768 1493.4756 1506.1118 1524.4806 1559.0494 1600.6017 1606.0219 1615.3278 1620.5367 1629.2325 1635.4819 1670.3126 2904.6348 2946.7158 2956.8374 3001.2169 3003.3542 3018.3405 3030.2112 3064.7040 3086.9953 3101.2908 3104.0801 3105.8334 3140.3469 3143.8411 3158.9170 3161.8375 3179.8966 3535.4906 3544.1017 3691.8375
redmass: 6.6764 6.8957 5.3223 5.9611 7.7797 7.1828 7.3917 3.9123 4.2024 6.0840 4.3157 1.2304 3.7210 3.3422 4.8224 3.6404 7.7548 3.8188 1.8629 2.1917 4.6565 3.7081 3.4337 6.8911 2.5979 2.1924 2.8483 4.8030 4.2804 4.0010 4.6994 7.9568 8.7855 2.9983 3.0781 3.7445 4.6286 1.6798 3.0609 3.4228 3.3248 2.5067 1.2018 5.4736 6.7846 6.6797 6.7516 8.7250 5.3611 8.5549 3.9297 7.2433 5.9884 4.1783 4.5844 9.7024 9.0803 5.7782 1.3557 1.3080 1.7852 2.8088 1.2056 2.6143 7.9986 4.8166 3.5953 1.3675 1.3482 2.7260 3.3180 2.7666 2.3222 4.5240 3.9426 2.7928 2.0636 1.3063 1.2630 1.5942 2.5657 2.2225 1.5595 5.7493 1.2107 1.2085 1.4517 3.9338 1.9132 2.3362 1.6852 1.7926 1.5010 1.3859 1.7287 3.1787 1.2432 2.5322 3.9611 4.4155 1.1924 3.2127 2.6660 1.2070 1.3445 1.0501 1.1246 1.0530 1.0501 3.5543 1.0918 1.2460 2.2235 7.3044 8.9630 1.3103 7.6163 4.5151 6.1659 7.9714 4.5757 1.0584 1.0986 1.0385 1.0296 1.0592 1.0611 1.0997 1.1018 1.1048 1.1043 1.0967 1.0802 1.0867 1.1045 1.0874 1.0958 1.0963 1.0747 1.0481 1.1045
irintensity: 2.4532 8.5991 0.5695 3.0805 6.5995 0.9356 0.7681 1.1336 2.8821 3.3422 1.0372 0.3012 0.7005 1.5791 0.9122 2.0512 1.9488 3.4674 6.2036 1.7119 17.2119 16.0532 7.7749 1.2501 27.6921 32.1257 23.5920 1.0740 18.0476 8.0675 10.2867 0.4181 2.5260 0.4850 21.0286 5.4425 3.1999 147.2295 13.8287 34.6870 8.2113 25.7350 157.0609 1.8364 10.3452 4.1842 2.9268 5.0334 0.5228 2.8191 30.9977 9.9233 1.5597 2.1055 15.1804 18.5395 15.0558 11.1416 6.8018 2.4182 53.2893 34.7353 110.0626 16.2512 5.3398 44.5968 148.9498 3.7092 0.9991 5.4277 5.8572 30.1198 126.0878 57.4327 203.0346 37.9603 17.8720 21.4159 0.0629 32.1187 60.1724 297.2823 41.8810 157.6687 157.1799 68.1191 39.9747 3.1044 13.9724 410.4699 58.4638 15.0130 250.8674 12.1539 155.7295 114.3735 76.0435 64.2029 41.7345 71.2769 60.9587 98.0962 13.3952 77.5335 3.3247 13.4697 19.1828 14.3555 14.9315 98.9624 21.0940 8.2975 182.9259 16.6247 441.9074 29.6798 436.5530 1027.3801 272.2690 20.7322 506.4621 90.5935 17.2510 71.4327 53.9634 1.0783 25.2855 33.5197 1.4037 11.3325 28.8788 15.1951 123.4913 12.2556 17.8800 5.1169 24.8072 7.2387 18.0316 99.3442 48.3597
temp: 298.150 k
press: 1.00000 atm
elementType: 8 8 8 8 8 8 7 7 7 7 7 7 6 6 6 6 6 6 6 6 6 6 6 6 6 6 6 6 6 1 1 1 1 1 1 1 1 1 1 1 1 1 1 1 1 1 1 1 1
symmnumber: 1
zpe: 972524.1 jmol-1
zpe.correction: 0.370415 hartree
zpe.thermalcorrener: 0.399347 hartree
zpe.thermalcorrenthalpy: 0.400291 hartree
zpe.thermalcorrgfe: 0.304588 hartree
zpe.sumelectzpe: -1437.444516 hartree
zpe.sumelectthermal: -1437.415584 hartree
zpe.sumelectthermalent: -1437.414640 hartree
zpe.sumelectthermalfe: -1437.510343 hartree
dipole: 13.9368 1.3670 -4.5429
dipole: 14.7221
quadrupole: -276.8569 -157.8394 -169.6816
quadrupole: -24.6886 7.9715 -0.2178
quadrupole: -75.3976 43.6199 31.7777 -24.6886 7.9715 -0.2178
hfenergy: -1437.8149309 hartree
pointgroup: C01 [X(C17H20N6O6)]
dipole: 5.4315674 -0.8819233 1.8080451 debye
polarizability: 402.462888|-54.6798909|316.9266491|29.1702878|12.5935772|138.3896004 unknown
InChI: InChI=1S/C17H20N6O6/c1-22(11-5-3-10(4-6-11)16(26)29-2)8-7-12(24)9-19-14-13(23(27)28)15(25)21-17(18)20-14/h3-6,19-20H,7-9,18H2,1-2H3
charge 0 multiplicity 1
49 atoms
O  -1.522243 2.95404 0.756942
O  7.58233 -1.851499 0.241566
O  -7.512531 -1.079076 -0.088607
O  5.866835 -3.213215 -0.563448
O  -4.949512 2.289674 -0.132234
O  -6.820062 1.406842 -1.087648
N  2.837637 2.515072 0.338035
N  -3.03879 0.723514 0.582588
N  -3.542998 -1.583646 0.607418
N  -5.673965 -2.511928 -0.001897
N  -5.724914 1.251473 -0.441615
N  -3.84706 -3.921381 0.41955
C  1.402801 2.428934 0.058779
C  0.58268 1.845451 1.266613
C  3.670943 1.393738 0.2283
C  -0.907526 1.879695 0.973741
C  -1.641266 0.525761 0.922082
C  3.339467 3.748435 0.967587
C  5.051727 1.469345 0.603105
C  3.186024 0.137755 -0.267466
C  -3.952564 -0.266879 0.379979
C  5.895902 0.35484 0.482887
C  4.039594 -0.967227 -0.385046
C  5.406337 -0.883003 -0.009874
C  -5.291687 -0.067836 -0.051421
C  -4.410459 -2.663319 0.316339
C  -6.263649 -1.20764 -0.050964
C  6.253375 -2.088721 -0.148221
C  8.490301 -3.013346 0.123457
H  1.228895 1.817918 -0.844482
H  1.0114 3.436842 -0.159378
H  0.774813 2.491325 2.144042
H  0.93086 0.825183 1.505775
H  -1.501145 0.050704 1.921204
H  -1.108143 -0.115909 0.183796
H  3.689231 3.576962 2.00559
H  4.17695 4.181978 0.388693
H  2.530076 4.494894 0.997152
H  -3.42416 1.688755 0.437575
H  5.468284 2.404977 0.984658
H  2.142015 0.024453 -0.573663
H  6.948082 0.431368 0.771344
H  3.665048 -1.921814 -0.770305
H  -2.6405 -1.757342 1.052901
H  -4.480086 -4.704473 0.268203
H  -2.843487 -4.085877 0.397541
H  8.137823 -3.843524 0.758927
H  8.53806 -3.359347 -0.923002
H  9.468061 -2.642733 0.462704
