program: Gaussian 09
title: 000271963
version: EM64L-G09RevD.01
frameworkgroup: C1[X(C20H13ClN4O2)]
method: RPBEPBE
basis: SDD
operation: Freq
keyword: #p
keyword: freq=noraman
keyword: PBEPBE/SDD
title: #p freq=noraman PBEPBE/SDD
converged: YES YES NO NO
title: Mulliken charges:
elementType: Cl O O N N N N C C C C C C C C C C C C C C C C C C C C H H H H H H H H H H H H H
charge: -0.025163 -0.209002 -0.239222 -0.042799 -0.430763 0.006334 0.025086 0.314308 0.240928 0.241683 -0.095579 -0.091493 -0.311071 -0.338557 -0.313991 -0.305278 -0.275682 -0.279586 -0.230731 -0.232775 0.354751 -0.400075 0.219688 -0.264479 -0.346423 -0.144216 -0.213341 0.278415 0.193294 0.269398 0.270689 0.298388 0.232243 0.234064 0.235238 0.237654 0.284430 0.291760 0.293529 0.268347
chargesum: 0.00000
title: Mulliken charges with hydrogens summed into heavy atoms:
elementType: Cl O O N N N N C C C C C C C C C C C C C C C C C C C C
charge: -0.025163 -0.209002 -0.239222 -0.042799 -0.132375 0.006334 0.025086 0.314308 0.240928 0.241683 -0.095579 -0.091493 -0.032656 -0.145263 -0.044593 -0.034589 -0.043439 -0.045522 0.004507 0.004878 0.354751 -0.115645 0.219688 0.027282 -0.052894 -0.144216 0.055007
polarizability: 6.50249628e+02 -1.17936008e+01 4.03828984e+02 -1.04670832e+01 -8.25619134e+00 1.05541978e+02
1716.lowfreq: -3.4752 -0.0013 0.0002 0.0006 2.8191 4.5297 9.5174 24.4614 31.1912
frequency: 8.7391 24.4416 31.1697 37.8222 64.1029 79.0735 98.9083 108.8173 114.8094 137.1453 156.5404 205.3717 220.6770 240.5988 253.9490 264.9242 302.1620 304.5232 316.6453 327.7693 371.0408 390.3029 407.5443 426.8417 441.9598 448.7463 472.9934 485.3893 503.4340 540.1201 563.4775 571.7120 575.3358 599.2674 621.6717 631.2912 640.2691 651.0922 654.6016 678.6388 694.7592 721.3106 722.0526 746.5389 757.9543 778.9463 785.0962 799.8145 828.8337 838.4734 862.6325 870.9739 886.6741 905.3417 914.7070 928.1649 934.1080 954.3203 980.6976 981.7975 994.8970 1000.6534 1021.8318 1029.6496 1050.4653 1075.0344 1086.1171 1109.0653 1135.3400 1145.7116 1161.7049 1170.5500 1180.7301 1193.5178 1222.5638 1229.4012 1252.0734 1261.3622 1285.7946 1295.4467 1301.0431 1345.7597 1354.4924 1373.0256 1382.4012 1399.0156 1421.1903 1422.1501 1439.5966 1446.8483 1452.1214 1475.1072 1507.0030 1521.5393 1530.2928 1548.8960 1553.5764 1577.3458 1597.1544 1612.1617 1629.3334 3089.8834 3106.2695 3135.0121 3140.6883 3152.0716 3157.9154 3172.4039 3174.4438 3176.0670 3184.5192 3194.1838 3202.6564 3386.1360
redmass: 8.8160 8.6305 8.0469 7.2118 5.0668 7.8700 3.8601 6.5195 6.0155 9.0376 3.4789 4.6417 8.2491 4.9122 5.5656 5.1957 16.3100 5.9394 6.1746 6.4587 6.4627 7.0901 3.5207 5.5983 3.8858 6.5032 2.9044 8.7303 3.3549 7.2237 6.5195 4.3244 3.8447 7.1201 3.5291 6.5792 6.2439 5.2882 5.8114 5.1327 1.6601 6.8144 4.8947 3.3892 1.4022 1.4008 7.8278 2.8283 1.4214 6.3437 1.7450 5.8632 1.6573 1.3955 5.3838 5.9357 1.5609 1.3697 1.3472 1.3244 1.3340 1.3294 2.2658 2.1245 5.5368 4.7125 1.8314 2.1135 2.1217 1.5049 1.2562 2.3696 1.8009 1.8739 2.0374 1.5358 2.6306 1.5112 1.6693 2.8024 3.3662 3.4508 3.3936 3.3474 3.2781 3.2782 6.1391 6.0651 2.5472 2.6953 2.7880 2.6196 5.2775 4.9911 5.0174 7.2455 6.4527 2.1970 7.1562 4.8529 6.3679 1.0895 1.0874 1.0867 1.0881 1.0916 1.0939 1.0983 1.0997 1.0890 1.0918 1.0971 1.0933 1.0734
irintensity: 0.2255 0.3582 0.5975 0.7908 0.3259 4.6607 0.8320 1.9179 1.2241 2.1152 16.1966 9.3727 4.4028 0.0932 2.1019 11.0930 1.1638 1.0292 0.4297 0.2809 2.7827 0.0902 6.8561 0.4062 4.2841 3.7791 0.1846 28.0216 0.0640 7.5698 1.1016 0.1040 4.6426 3.6515 12.1376 19.6670 16.9814 8.3963 5.3449 13.1741 48.0243 2.3353 1.2577 2.0040 94.5686 89.6625 25.5334 0.9439 38.7320 4.6600 4.1257 9.0399 1.7993 2.2737 39.3020 15.6588 50.1820 2.1598 2.2880 3.9868 0.4243 0.1657 5.2250 9.9019 3.9781 13.1160 15.7074 5.4428 114.9025 27.8336 43.1270 481.3157 215.3995 46.6919 144.7332 20.6120 2.6745 4.6778 0.2539 7.2876 92.1099 16.5269 25.8464 3.3845 320.2786 37.1789 121.9762 6.9899 18.9065 73.5662 0.2778 0.0440 407.3882 123.9168 87.3020 9.3980 223.4360 46.3050 98.3270 8.7358 1.6134 32.4961 8.4857 9.6094 11.3110 11.8012 14.5754 24.3574 30.6270 1.6557 2.0032 2.6050 12.8281 25.4581
temp: 298.150 k
press: 1.00000 atm
elementType: 17 8 8 7 7 7 7 6 6 6 6 6 6 6 6 6 6 6 6 6 6 6 6 6 6 6 6 1 1 1 1 1 1 1 1 1 1 1 1 1
symmnumber: 1
zpe: 753236.6 jmol-1
zpe.correction: 0.286893 hartree
zpe.thermalcorrener: 0.308616 hartree
zpe.thermalcorrenthalpy: 0.309561 hartree
zpe.thermalcorrgfe: 0.232829 hartree
zpe.sumelectzpe: -1597.501276 hartree
zpe.sumelectthermal: -1597.479553 hartree
zpe.sumelectthermalent: -1597.478608 hartree
zpe.sumelectthermalfe: -1597.555340 hartree
dipole: -0.6661 0.8784 0.6005
dipole: 1.2554
quadrupole: -160.8266 -161.4860 -168.0355
quadrupole: 22.9513 1.4201 -7.2388
quadrupole: 2.6227 1.9634 -4.5862 22.9513 1.4201 -7.2388
hfenergy: -1597.7881691 hartree
pointgroup: C01 [X(C20H13Cl1N4O2)]
dipole: 0.2957348 -0.2448012 0.3107219 debye
polarizability: 645.5272107|31.5979453|397.586391|34.542624|-49.6876291|116.5069889 unknown
InChI: InChI=1S/C20H13ClN4O2/c21-14-9-10-19(25(26)27)13(11-14)12-22-24-20-15-5-1-3-7-17(15)23-18-8-4-2-6-16(18)20/h1-12,24H
charge 0 multiplicity 1
40 atoms
Cl -4.11015 -3.817113 1.281756
O  -5.869606 2.050743 -1.477223
O  -3.662896 2.55525 -1.29914
N  4.532367 -0.319892 0.218573
N  0.412757 0.783807 -0.246483
N  -0.71453 0.031689 -0.086357
N  -4.660269 1.739185 -1.13837
C  1.732264 0.350916 -0.042841
C  2.131224 -1.024281 0.076326
C  2.734757 1.38851 0.000741
C  3.56486 -1.290088 0.215347
C  4.129932 0.984267 0.110706
C  1.238772 -2.154031 0.043042
C  2.445276 2.79823 -0.045696
C  4.019916 -2.65031 0.336832
C  5.157754 1.991925 0.118804
C  1.721528 -3.456936 0.152843
C  3.465328 3.748375 -0.029609
C  3.123811 -3.712543 0.309671
C  4.839119 3.343135 0.042992
C  -3.123117 -0.093286 -0.191588
C  -1.866572 0.636262 -0.365323
C  -4.425671 0.403728 -0.544822
C  -3.073147 -1.40777 0.37307
C  -5.593664 -0.377414 -0.34435
C  -4.236353 -2.156452 0.559202
C  -5.5154 -1.662429 0.20776
H  0.170237 -1.971909 -0.065517
H  1.413536 3.171324 -0.060104
H  5.098563 -2.797537 0.44478
H  6.190535 1.638762 0.193305
H  0.298248 1.766056 -0.537227
H  1.019248 -4.297123 0.120678
H  3.215222 4.814168 -0.05996
H  3.483331 -4.743078 0.401706
H  5.629036 4.101418 0.051356
H  -1.920218 1.672021 -0.727067
H  -2.09898 -1.804389 0.667163
H  -6.555914 0.050741 -0.633885
H  -6.413732 -2.264035 0.365907
