program: Gaussian 09
title: 000271953
version: EM64L-G09RevD.01
frameworkgroup: C1[X(C18H12ClN3O3)]
method: RPBEPBE
basis: SDD
operation: Freq
keyword: #p
keyword: freq=noraman
keyword: PBEPBE/SDD
title: #p freq=noraman PBEPBE/SDD
converged: YES YES NO NO
title: Mulliken charges:
elementType: Cl O O O N N N C C C C C C C C C C C C C C C C C C H H H H H H H H H H H H
charge: -0.014980 -0.195192 -0.203848 -0.231636 -0.409478 0.059124 0.026092 0.193839 0.396065 0.157101 -0.393732 -0.428075 -0.381411 -0.422820 -0.238114 0.112497 -0.246399 -0.241946 0.334141 0.227316 -0.268097 -0.344955 -0.376817 -0.145549 -0.206518 0.269211 0.245163 0.271666 0.242865 0.238626 0.235944 0.236360 0.325275 0.326109 0.293033 0.290504 0.268632
chargesum: 0.00000
title: Mulliken charges with hydrogens summed into heavy atoms:
elementType: Cl O O O N N N C C C C C C C C C C C C C C C C C C
charge: -0.014980 -0.195192 -0.203848 -0.231636 -0.084203 0.059124 0.026092 0.193839 0.396065 0.157101 -0.124521 -0.182911 -0.109745 -0.179954 0.000512 0.112497 -0.010455 -0.005586 0.334141 0.227316 0.058012 -0.051922 -0.086312 -0.145549 0.062115
polarizability: 4.54329701e+02 -5.30836965e+00 2.93445386e+02 -2.19083255e+01 1.85155187e+01 1.35625974e+02
1716.lowfreq: -5.8662 -1.0233 -0.0021 -0.0020 -0.0014 2.0958 11.8482 17.2834 26.9381
frequency: 11.3792 17.2549 26.9248 30.6676 67.0244 69.7503 79.1266 112.1092 144.7346 171.4528 180.9439 195.0101 204.0698 209.3372 253.1578 278.8902 301.2703 323.8607 330.9313 334.7801 380.7904 406.3196 424.1826 447.9968 449.2672 471.4682 499.1904 507.3085 523.8910 560.7327 569.2308 577.0098 625.5840 642.6802 653.9119 658.1984 676.6898 695.8224 718.5558 726.7555 759.5390 783.3781 787.8601 789.6119 792.4852 829.3204 833.0414 868.1825 890.6732 915.4184 933.7012 939.5047 954.3258 974.1480 983.3591 994.2239 1000.5899 1001.6799 1027.4600 1046.7066 1054.8111 1089.4969 1093.7721 1131.2934 1149.1954 1154.8453 1178.8402 1184.7023 1195.0372 1215.8542 1236.5962 1239.6536 1261.0159 1283.0441 1299.1691 1356.9898 1370.0678 1385.6715 1401.6999 1411.1462 1417.2710 1439.6095 1448.6220 1451.9267 1496.1275 1514.9976 1530.8832 1561.1823 1583.2145 1591.3162 1597.5385 1622.5392 1629.7964 3094.4803 3127.2667 3130.5248 3136.7731 3149.8578 3152.5334 3167.6981 3168.6647 3172.8857 3175.4452 3194.2361 3366.2507
redmass: 7.9708 13.0018 7.3805 6.6823 8.5098 6.3605 8.0170 5.5783 6.5334 5.2269 7.1931 6.0098 6.3325 3.6286 5.6508 5.4157 18.2318 5.8150 9.0097 5.9486 5.8054 3.9836 8.6690 3.6522 4.3022 3.2976 8.0420 5.3850 6.9111 4.9190 5.4152 4.8051 4.3226 4.8148 5.7092 4.9590 1.3251 7.5925 3.8069 5.1072 1.4864 6.6668 4.0993 2.6668 4.4307 1.6936 1.4276 6.1693 1.6152 5.2543 1.3534 1.4153 1.5079 1.3825 1.3290 1.4816 1.3527 4.2605 2.8170 4.3130 3.1016 1.9198 2.7171 3.2106 1.6368 1.4847 1.2095 1.8960 2.0371 2.1895 1.8389 2.0762 1.4425 1.8857 1.9416 4.1790 2.4437 4.4549 2.7300 6.4544 6.5556 2.3915 2.3896 2.3930 1.9369 3.7441 6.1138 6.1583 7.2746 5.3084 7.4830 6.9368 6.7584 1.0903 1.0868 1.0877 1.0882 1.0915 1.0944 1.1002 1.0991 1.0928 1.0893 1.0968 1.0761
irintensity: 1.2940 0.0494 0.4941 0.9441 2.5495 8.0454 5.2886 1.9765 0.9772 0.7829 2.3668 4.6981 11.7383 11.8335 0.7261 4.7148 1.0794 5.2232 1.0183 7.1000 6.0163 1.0345 0.0306 5.7984 6.7743 1.1182 18.0354 9.1367 3.1934 9.2316 5.9654 1.2406 1.1095 1.2888 8.4045 10.1815 90.8199 18.0181 8.4823 1.0228 3.1065 16.6820 8.3670 51.9680 50.7547 38.4817 37.9295 12.5537 6.0007 95.1451 0.0927 2.9328 50.0407 2.8255 5.4518 2.4564 1.6213 3.1562 12.6718 5.2657 34.7203 18.1476 22.8758 468.3193 77.5859 139.7785 54.8635 143.0552 164.1621 206.0491 6.5135 181.9939 2.0732 57.9616 129.5420 20.1054 3.5119 99.3769 2.6275 0.6497 11.7619 1.7207 120.9201 39.4679 459.4033 19.7930 86.9997 99.0930 25.9271 4.3219 68.9373 143.6748 26.3767 48.8314 1.6354 3.7159 2.0969 8.3609 33.8016 32.2679 10.7949 5.4180 1.0470 2.7492 1.7066
temp: 298.150 k
press: 1.00000 atm
elementType: 17 8 8 8 7 7 7 6 6 6 6 6 6 6 6 6 6 6 6 6 6 6 6 6 6 1 1 1 1 1 1 1 1 1 1 1 1
symmnumber: 1
zpe: 689515.6 jmol-1
zpe.correction: 0.262623 hartree
zpe.thermalcorrener: 0.283506 hartree
zpe.thermalcorrenthalpy: 0.284450 hartree
zpe.thermalcorrgfe: 0.208794 hartree
zpe.sumelectzpe: -1541.281239 hartree
zpe.sumelectthermal: -1541.260355 hartree
zpe.sumelectthermalent: -1541.259411 hartree
zpe.sumelectthermalfe: -1541.335067 hartree
dipole: 3.2398 1.2045 -0.1084
dipole: 3.4581
quadrupole: -114.3670 -172.3869 -148.9368
quadrupole: 11.7987 -7.2966 12.5119
quadrupole: 30.8632 -27.1566 -3.7066 11.7987 -7.2966 12.5119
hfenergy: -1541.5438613 hartree
pointgroup: C01 [X(C18H12Cl1N3O3)]
dipole: -1.2881073 0.3606705 0.2485024 debye
polarizability: 450.9421609|22.630799|287.6633966|-30.2481508|36.762925|144.7955041 unknown
InChI: InChI=1S/C18H12ClN3O3/c19-14-8-9-17(22(24)25)13(10-14)11-20-21-18(23)16-7-3-5-12-4-1-2-6-15(12)16/h1-11,21H
charge 0 multiplicity 1
37 atoms
Cl 5.572355 -2.272195 -1.927989
O  -0.871074 -2.737108 -0.940129
O  4.573727 3.102456 1.977817
O  2.378194 2.559236 1.798092
N  -0.467593 -0.692758 0.144995
N  0.878021 -0.721446 -0.09959
N  3.628649 2.339885 1.534933
C  -3.471503 -0.258462 -0.126741
C  -4.850526 -0.196135 0.327572
C  -2.771295 -1.521473 -0.013898
C  -2.902316 0.924604 -0.715114
C  -5.487823 -1.378404 0.827839
C  -3.449546 -2.664821 0.438182
C  -5.56716 1.043471 0.242566
C  -4.808034 -2.59715 0.861666
C  -1.316455 -1.720169 -0.351755
C  -3.631435 2.114219 -0.793484
C  -4.969427 2.18371 -0.295035
C  3.066355 0.220573 0.189119
C  4.008076 1.179912 0.691114
C  3.590366 -0.836529 -0.616711
C  5.392975 1.076703 0.40001
C  1.615805 0.231313 0.445392
C  4.95766 -0.914486 -0.895245
C  5.88275 0.032479 -0.395727
H  -1.900044 0.886125 -1.153856
H  -6.527347 -1.312297 1.169986
H  -2.905771 -3.614399 0.472763
H  -6.603652 1.075436 0.598577
H  -5.306229 -3.501546 1.225004
H  -3.179364 2.9993 -1.253943
H  -5.525214 3.125099 -0.356828
H  -0.885637 0.048778 0.73043
H  2.885231 -1.577678 -1.002665
H  6.06638 1.832311 0.810617
H  1.207332 1.031366 1.07703
H  6.948268 -0.048318 -0.624792
