program: Gaussian 09
title: 000271957
version: EM64L-G09RevD.01
frameworkgroup: C1[X(C24H16N2OS)]
method: RPBEPBE
basis: SDD
operation: Freq
keyword: #p
keyword: freq=noraman
keyword: PBEPBE/SDD
title: #p freq=noraman PBEPBE/SDD
converged: YES YES NO NO
title: Mulliken charges:
elementType: S O N N C C C C C C C C C C C C C C C C C C C C C C C C H H H H H H H H H H H H H H H H
charge: 0.205946 -0.209531 0.039689 -0.441339 0.447823 0.413201 -0.087196 -0.346023 -0.346480 0.189945 0.154376 0.396410 -0.345150 -0.383004 -0.286529 -0.275011 -0.389182 0.103970 -0.388513 -0.434871 -0.242518 -0.250578 -0.428154 -0.228058 -0.228004 -0.239545 -0.250503 -0.244330 0.282213 0.284895 0.248503 0.252772 0.270487 0.271999 0.242120 0.235097 0.238903 0.239861 0.233441 0.238692 0.234860 0.353535 0.233300 0.232484
chargesum: 0.00000
title: Mulliken charges with hydrogens summed into heavy atoms:
elementType: S O N N C C C C C C C C C C C C C C C C C C C C C C C C
charge: 0.205946 -0.209531 0.039689 -0.087805 0.447823 0.413201 -0.087196 -0.346023 -0.346480 0.189945 0.154376 0.396410 -0.062937 -0.098109 -0.038026 -0.022239 -0.118695 0.103970 -0.116514 -0.192751 -0.007422 -0.011675 -0.188293 0.005382 0.010688 -0.004685 -0.017203 -0.011847
polarizability: 4.34990639e+02 1.66431071e+01 3.33242470e+02 -5.87710633e+01 2.72848700e+01 2.00985785e+02
1716.lowfreq: -9.6378 -4.3706 0.0008 0.0015 0.0022 2.8660 14.0464 24.4719 30.3653
frequency: 13.9509 24.4433 30.3416 45.4733 69.2605 76.2401 103.8227 126.1001 148.7459 161.5782 179.1732 190.5019 216.9761 224.8159 252.4648 264.7312 322.6694 325.6308 339.7028 350.3355 396.7050 407.2375 424.8861 435.2275 439.9469 453.5180 463.5757 473.4720 489.3053 506.5777 516.8823 523.1437 561.0655 588.0641 626.6827 636.0327 638.0886 650.9307 661.2733 676.5314 693.3469 714.1279 726.0740 739.5877 750.3667 757.3027 766.2655 775.3086 788.0978 789.5882 807.2512 828.3060 872.5144 878.5868 881.8732 890.8547 929.6628 937.3278 956.0003 965.3177 973.1835 989.5836 991.9758 993.7500 999.9582 1004.9278 1022.2909 1024.5964 1034.5165 1036.8603 1054.1496 1060.0768 1081.6857 1119.7502 1128.9677 1141.4038 1154.1581 1174.3749 1178.4593 1179.2362 1187.1885 1192.2658 1235.6343 1241.5582 1246.3842 1271.4864 1284.3773 1323.0452 1364.2495 1369.0842 1376.2916 1400.6667 1411.2792 1420.8979 1423.4493 1439.2617 1448.8500 1453.8096 1457.8890 1479.3013 1514.2725 1523.3435 1561.1839 1577.2131 1583.6653 1590.8783 1591.3587 1602.7751 1614.2209 1629.3372 3123.7060 3126.9205 3132.5662 3133.7834 3136.1623 3139.2388 3146.3669 3147.4781 3152.3606 3152.6498 3160.8435 3165.7951 3167.0639 3170.2207 3174.0158 3386.2093
redmass: 5.6911 6.7736 5.5417 6.7169 7.6615 5.0844 4.8451 4.4179 5.9184 5.5182 4.2888 5.9225 6.3467 5.0051 5.5142 6.6512 7.0622 5.5208 6.5743 5.5458 6.4252 4.2323 7.0620 5.3539 3.7898 4.1937 4.6658 3.4411 4.9672 5.3897 4.2374 6.7348 4.5929 4.9403 5.0029 2.9040 3.8554 6.2612 5.5805 1.7587 6.9655 3.9483 4.0633 6.6247 2.4371 1.4319 1.3378 1.6825 5.3094 1.8665 5.7816 1.6803 1.4031 3.6517 1.4909 1.6779 4.9024 1.5254 1.3841 1.3664 1.3922 1.3494 1.3647 1.3659 1.4012 4.5352 4.0253 4.9948 3.4975 2.8682 2.4936 2.4067 2.5989 1.8295 2.2370 1.7252 1.3934 1.0601 1.1038 1.0855 2.2077 1.5537 1.8567 2.0737 1.5532 1.4772 1.9115 2.4962 9.3100 2.4836 9.1262 2.6225 6.3134 2.1757 2.2813 2.4271 2.2463 2.3611 2.3790 1.9465 3.8669 7.6552 6.2488 7.1048 7.3850 5.5168 5.9978 6.4115 7.3427 6.6144 1.0869 1.0874 1.0858 1.0857 1.0884 1.0894 1.0906 1.0916 1.0943 1.0946 1.0954 1.0989 1.0999 1.1010 1.0995 1.0762
irintensity: 0.2714 0.2193 0.6585 2.2492 1.5212 1.4076 2.4686 1.1814 1.1867 1.9556 2.1127 1.9531 0.4859 1.7161 1.5090 1.3733 4.6511 0.6669 5.5789 9.8751 3.2243 0.6612 1.2440 4.3244 1.8348 2.0017 23.5644 5.0479 9.0902 6.9888 1.6675 2.9103 13.6587 0.9641 13.9883 32.6909 14.7981 5.2462 1.9221 45.6345 6.8401 6.4157 12.6432 6.1072 27.1964 5.0384 18.3914 88.7274 0.1727 76.7416 23.0748 44.1030 0.4038 24.6857 2.9507 6.8481 12.2825 5.1715 3.6824 1.8927 6.3115 1.7162 2.8877 1.8033 4.1668 6.0868 11.6450 38.3533 18.0276 17.6083 43.3044 6.0350 27.9081 4.0167 70.5311 53.6309 30.0607 3.3210 1.9132 14.0231 32.6031 134.7867 3.8411 125.7158 11.6607 3.8200 38.9673 28.5216 5.9880 4.5327 1.3714 1.8137 0.2709 19.2227 45.5709 1.5639 37.0947 34.8961 77.7276 326.6073 15.2647 7.3195 10.2317 16.7453 15.3875 13.5520 23.4228 2.1735 193.0018 6.6706 1.6728 3.8700 0.4975 0.4514 5.3057 1.9015 9.4719 13.8509 28.7789 12.0035 18.4289 31.6273 11.3880 22.0652 19.6483 14.3570
temp: 298.150 k
press: 1.00000 atm
elementType: 16 8 7 7 6 6 6 6 6 6 6 6 6 6 6 6 6 6 6 6 6 6 6 6 6 6 6 6 1 1 1 1 1 1 1 1 1 1 1 1 1 1 1 1
symmnumber: 1
zpe: 868838.0 jmol-1
zpe.correction: 0.330923 hartree
zpe.thermalcorrener: 0.352794 hartree
zpe.thermalcorrenthalpy: 0.353738 hartree
zpe.thermalcorrgfe: 0.278042 hartree
zpe.sumelectzpe: -1505.057328 hartree
zpe.sumelectthermal: -1505.035457 hartree
zpe.sumelectthermalent: -1505.034512 hartree
zpe.sumelectthermalfe: -1505.110209 hartree
dipole: 0.8810 5.1143 -1.3702
dipole: 5.3675
quadrupole: -140.2063 -167.1521 -164.3252
quadrupole: 10.4285 -7.7804 3.2054
quadrupole: 17.0215 -9.9242 -7.0973 10.4285 -7.7804 3.2054
hfenergy: -1505.3882508 hartree
pointgroup: C01 [X(C24H16N2O1S1)]
dipole: 0.3978114 -1.8608796 -0.9155533 debye
polarizability: 423.0645914|-63.7719134|249.2654051|48.8305578|61.037721|296.8888974 unknown
InChI: InChI=1S/C24H16N2OS/c27-24(18-13-7-9-16-8-1-2-10-17(16)18)26-25-23-19-11-3-5-14-21(19)28-22-15-6-4-12-20(22)23/h1-15,26H
charge 0 multiplicity 1
44 atoms
S  -3.689477 -0.516783 -2.208094
O  1.063039 2.196625 2.406725
N  -0.931931 0.96016 0.869907
N  0.383787 0.540789 0.883107
C  -3.216411 0.844556 0.25088
C  -1.705088 -1.161296 -0.267564
C  -1.871629 0.210941 0.297427
C  -4.127613 0.582846 -0.806387
C  -2.448376 -1.588726 -1.405801
C  3.338535 0.462232 0.096789
C  2.766243 0.780246 1.388544
C  4.684193 -0.084943 0.055474
C  -3.60592 1.769456 1.260139
C  -0.842871 -2.117662 0.351378
C  -5.39011 1.218646 -0.859484
C  -2.2593 -2.876861 -1.961203
C  3.540048 0.64141 2.551379
C  1.354841 1.278639 1.594722
C  2.671801 0.708914 -1.153889
C  5.418883 -0.256032 1.274271
C  -4.858299 2.407737 1.21294
C  -0.661586 -3.404232 -0.190112
C  5.271562 -0.419442 -1.209901
C  -5.755236 2.131689 0.150809
C  -1.352894 -3.777487 -1.367783
C  4.865799 0.121122 2.499342
C  3.276881 0.38334 -2.370536
C  4.580821 -0.20234 -2.402659
H  -2.889612 1.982418 2.058988
H  -0.347255 -1.861213 1.293967
H  -6.079889 0.996355 -1.680569
H  -2.841667 -3.178771 -2.838352
H  3.097281 0.934606 3.508815
H  1.692512 1.197983 -1.159163
H  6.432308 -0.672068 1.225487
H  -5.138558 3.117419 1.998259
H  0.005988 -4.114853 0.307721
H  6.285072 -0.838075 -1.223329
H  -6.734879 2.619907 0.111703
H  -1.21206 -4.772857 -1.801895
H  5.43924 0.010349 3.425438
H  0.692305 -0.268592 0.324353
H  2.753048 0.590118 -3.31011
H  5.039275 -0.458166 -3.363832
