program: Gaussian 09
title: 000271946
version: EM64L-G09RevD.01
frameworkgroup: C1[X(C18H13N3O3)]
method: RPBEPBE
basis: SDD
operation: Freq
keyword: #p
keyword: freq=noraman
keyword: PBEPBE/SDD
title: #p freq=noraman PBEPBE/SDD
converged: NO YES NO NO
title: Mulliken charges:
elementType: O O O N N N C C C C C C C C C C C C C C C C C C H H H H H H H H H H H H H
charge: -0.195768 -0.214185 -0.209626 -0.411652 0.074694 0.025056 0.192832 0.395450 0.154068 -0.397149 -0.428589 -0.381554 -0.422900 -0.237930 -0.249007 0.114863 -0.242851 0.478299 -0.365123 -0.346020 0.381592 -0.357363 -0.351589 -0.385793 0.270463 0.245264 0.272185 0.243084 0.238942 0.234577 0.236036 0.315569 0.235471 0.294234 0.287427 0.288842 0.218154
chargesum: 0.00000
title: Mulliken charges with hydrogens summed into heavy atoms:
elementType: O O O N N N C C C C C C C C C C C C C C C C C C
charge: -0.195768 -0.214185 -0.209626 -0.096084 0.074694 0.025056 0.192832 0.395450 0.154068 -0.126686 -0.183326 -0.109369 -0.179816 0.001012 -0.014430 0.114863 -0.006815 0.478299 -0.129652 -0.051786 0.381592 -0.069936 -0.062747 -0.167639
polarizability: 5.05458786e+02 1.39942324e+01 2.45459255e+02 1.93722476e+01 -9.64514085e+00 1.22687339e+02
1716.lowfreq: -3.7621 -0.0006 -0.0005 0.0005 1.3703 5.5377 21.1095 27.5077 30.3262
frequency: 21.0197 27.4268 30.3183 52.2512 70.2863 71.5034 89.1767 139.4821 167.7757 177.8457 180.8058 206.1295 229.7028 267.0762 270.3401 326.3024 337.6864 351.5710 405.5556 412.3906 412.9726 439.9508 471.1336 489.6733 502.4807 511.0041 517.8607 527.5809 574.8869 624.8453 633.9553 648.9225 662.1235 667.9788 668.6171 717.6997 743.3037 759.2183 769.7624 788.0479 789.2589 790.9888 828.4783 841.7533 845.6361 876.3831 890.3580 895.7034 935.4921 939.4566 973.7365 989.4364 993.8139 1000.0020 1000.4744 1001.4902 1013.8928 1026.6483 1049.3489 1086.5745 1093.2647 1112.0961 1134.4124 1154.4878 1175.8489 1179.2094 1190.9192 1218.5429 1236.9300 1239.0843 1242.6289 1282.1139 1297.3032 1336.1311 1360.1761 1369.7723 1400.9652 1404.9459 1412.1139 1422.0749 1439.2742 1452.1221 1477.6343 1498.5534 1515.3408 1559.5821 1583.6698 1590.7690 1592.6046 1611.5102 1623.8778 1630.2503 2978.4413 3126.5431 3129.6767 3134.3749 3135.7201 3150.0162 3151.8502 3165.3860 3167.1521 3168.6599 3183.5937 3187.0401 3366.5752
redmass: 6.9506 5.9054 6.3764 8.7938 6.8110 6.2836 6.5581 5.5572 5.9248 4.8697 7.7950 4.8419 4.7726 6.2001 3.6931 8.5438 5.8113 5.6161 4.5504 5.0394 3.0080 4.4877 3.2937 7.3438 3.8836 4.6647 5.1443 6.6551 4.3155 7.1291 3.8515 3.1544 1.9736 5.0060 3.2212 3.8087 4.3822 1.4890 7.7139 5.1528 2.3467 4.1180 1.7041 4.8749 1.3295 1.4284 1.6466 4.8701 1.5819 1.4139 1.3816 1.3678 1.6003 3.0554 1.4225 3.0836 1.3465 2.9086 2.8885 2.7505 3.1307 1.3704 2.7802 1.4152 1.3572 1.1166 1.3376 4.3437 1.8704 1.9553 2.0137 1.9132 1.3496 1.8206 5.7989 2.4616 2.8974 5.2147 6.4267 4.3563 2.4208 2.3805 2.1612 2.0757 3.7644 6.1806 7.3505 6.2716 5.5379 6.2591 6.9839 6.8607 1.0874 1.0868 1.0878 1.0905 1.0882 1.0915 1.0944 1.0897 1.1005 1.0988 1.0945 1.0966 1.0759
irintensity: 0.5318 0.1618 0.4242 6.0741 2.3683 0.1285 3.0845 1.1084 2.3942 0.7925 5.2062 3.3930 4.5226 3.8205 18.3751 1.3297 12.5730 5.7574 2.1241 0.1994 0.0097 7.1683 0.4723 1.9982 2.4853 6.4876 12.2890 0.8383 13.0876 0.5121 3.7404 11.8120 52.3432 23.3147 38.4761 11.6786 0.3776 7.0091 46.9976 2.6456 53.7952 23.4150 48.8973 1.1736 10.1751 27.7990 5.3530 38.0658 58.8192 2.4495 2.9089 0.0473 1.0158 1.0268 2.4085 1.5879 0.0110 6.1347 10.9119 111.8512 32.0627 36.5652 546.7944 106.7055 169.4089 5.0162 133.4255 583.8489 4.8875 81.9531 33.8666 58.5191 1.1138 2.9576 104.0609 4.1337 7.9303 9.1092 0.3185 39.3776 2.2580 5.1850 75.2924 476.9673 15.0196 66.4129 20.9175 4.1933 12.7167 52.6579 128.5123 38.1537 55.5077 1.3896 4.0217 10.0869 2.4985 7.5719 35.6584 0.5826 30.1094 13.6613 0.5182 1.0750 0.5883
temp: 298.150 k
press: 1.00000 atm
elementType: 8 8 8 7 7 7 6 6 6 6 6 6 6 6 6 6 6 6 6 6 6 6 6 6 1 1 1 1 1 1 1 1 1 1 1 1 1
symmnumber: 1
zpe: 715479.5 jmol-1
zpe.correction: 0.272512 hartree
zpe.thermalcorrener: 0.292004 hartree
zpe.thermalcorrenthalpy: 0.292949 hartree
zpe.thermalcorrgfe: 0.221877 hartree
zpe.sumelectzpe: -1081.898102 hartree
zpe.sumelectthermal: -1081.878609 hartree
zpe.sumelectthermalent: -1081.877665 hartree
zpe.sumelectthermalfe: -1081.948737 hartree
dipole: -8.7170 4.3102 -3.1232
dipole: 10.2136
quadrupole: -171.4611 -132.6193 -139.5448
quadrupole: -2.5534 3.2139 4.7384
quadrupole: -23.5860 15.2558 8.3302 -2.5534 3.2139 4.7384
hfenergy: -1082.1706135 hartree
pointgroup: C01 [X(C18H13N3O3)]
dipole: -3.4485219 -0.9190012 1.8466817 debye
polarizability: 503.4401945|-31.0509178|219.102053|-16.5270158|-51.8020448|151.0631328 unknown
InChI: InChI=1S/C18H13N3O3/c22-18(17-7-3-5-14-4-1-2-6-16(14)17)20-19-12-13-8-10-15(11-9-13)21(23)24/h1-12,20H
charge 0 multiplicity 1
37 atoms
O  -1.283606 1.955933 -1.789837
O  7.7236 -0.936406 0.778257
O  7.524756 0.266972 -1.151766
N  -0.810091 0.531033 0.017335
N  0.541195 0.524788 -0.221368
N  7.021918 -0.309613 -0.109593
C  -3.796883 -0.090572 -0.044235
C  -5.176115 -0.018411 0.407536
C  -3.141687 1.139228 -0.438879
C  -3.182635 -1.388824 -0.13018
C  -5.857781 1.242413 0.41175
C  -3.862605 2.343545 -0.465027
C  -5.848853 -1.217828 0.815806
C  -5.220786 2.400111 -0.038062
C  -3.870205 -2.540119 0.263435
C  -1.691702 1.241113 -0.840734
C  -5.208765 -2.456176 0.758836
C  2.770172 -0.132646 0.437609
C  3.592698 -0.809184 1.383321
C  3.376414 0.488764 -0.695357
C  5.556799 -0.248112 0.079451
C  4.986281 -0.87163 1.211326
C  4.765649 0.433493 -0.87782
C  1.320456 -0.087944 0.64907
H  -2.179932 -1.487326 -0.558723
H  -6.897036 1.278319 0.759132
H  -3.353208 3.249185 -0.809814
H  -6.886535 -1.145149 1.162341
H  -5.752302 3.356877 -0.053888
H  -3.386888 -3.519323 0.175987
H  -5.732579 -3.36649 1.068705
H  -1.207126 0.06637 0.849979
H  3.134471 -1.28744 2.257036
H  2.734357 1.007494 -1.413241
H  5.635458 -1.385871 1.924602
H  5.252833 0.901744 -1.737035
H  0.926664 -0.584815 1.558647
