program: Gaussian 09
title: 000271960
version: EM64L-G09RevD.01
frameworkgroup: C1[X(C24H23N3O2)]
method: RPBEPBE
basis: SDD
operation: Freq
keyword: #p
keyword: freq=noraman
keyword: PBEPBE/SDD
title: #p freq=noraman PBEPBE/SDD
converged: YES YES NO NO
title: Mulliken charges:
elementType: O O N N N C C C C C C C C C C C C C C C C C C C C C C C C H H H H H H H H H H H H H H H H H H H H H H H
charge: -0.241421 -0.229634 -0.056426 -0.440818 0.007282 0.313561 0.237155 0.223998 -0.093881 -0.094042 -0.330802 -0.313219 -0.313573 -0.322702 -0.292411 -0.287803 -0.236590 -0.234227 0.518519 0.221358 0.204248 -0.504918 -0.425899 -0.435903 -0.341119 -0.242929 -0.246253 -0.683995 -0.681861 0.181993 0.287404 0.266481 0.264603 0.278473 0.226619 0.217376 0.231570 0.228024 0.275230 0.203698 0.222309 0.249067 0.209497 0.213301 0.209860 0.209777 0.206293 0.233617 0.233130 0.205886 0.235020 0.235078
chargesum: 0.00000
title: Mulliken charges with hydrogens summed into heavy atoms:
elementType: O O N N N C C C C C C C C C C C C C C C C C C C C C C C C
charge: -0.241421 -0.229634 -0.056426 -0.162346 0.007282 0.313561 0.237155 0.223998 -0.093881 -0.094042 -0.148809 -0.025815 -0.047093 -0.058099 -0.065792 -0.070427 -0.005020 -0.006202 0.518519 0.221358 0.204248 -0.229689 -0.222201 -0.213594 -0.092052 0.179869 0.173384 -0.010955 -0.005877
polarizability: 6.55227427e+02 -8.63723717e-01 3.92593717e+02 -7.10091589e+00 -4.46928082e+00 1.29785218e+02
1716.lowfreq: -4.4701 -2.3310 -0.0007 0.0002 0.0008 2.0252 3.5160 18.9865 25.0678
frequency: 0.3748 18.9414 25.0269 38.1037 59.8785 66.7718 85.9529 95.1239 99.5846 101.1017 109.4418 123.0939 141.2869 151.9084 186.2338 205.2838 216.5995 238.6458 244.4626 247.0305 259.5288 270.2703 301.7996 312.0335 316.1261 329.6211 367.2315 394.3009 399.6933 410.5523 428.6793 462.9126 470.3441 482.6475 500.4391 507.1457 549.8704 572.3978 583.6613 599.3748 614.9673 625.2594 626.9770 639.9269 648.3253 653.0953 687.8951 741.1136 745.0447 748.7828 751.1411 764.6861 777.3792 794.8629 798.4110 826.3280 828.9956 837.6845 856.9268 870.6910 877.6439 881.7748 885.2103 901.3143 905.9775 923.2862 933.8390 944.2187 980.6745 990.0948 994.8198 998.1623 1021.5788 1029.5833 1030.9202 1032.5292 1066.4486 1105.3678 1114.0115 1116.4696 1127.9889 1132.5291 1133.5181 1135.5796 1156.0935 1164.1483 1179.1605 1194.9694 1223.5022 1228.5737 1252.8851 1260.8761 1261.0518 1264.2118 1275.6612 1283.6023 1294.2583 1337.0409 1348.5718 1363.7314 1365.0899 1380.3931 1395.1980 1399.6300 1401.9504 1405.3394 1424.6291 1434.3566 1439.4784 1450.4275 1459.7627 1460.6353 1471.9472 1474.1321 1476.5187 1485.2388 1488.0565 1501.2101 1524.6410 1531.6101 1551.5212 1553.4732 1573.9899 1586.3918 1605.2910 1612.4104 1629.1547 2954.2931 2954.7434 2963.2111 2997.8372 2998.6953 3013.2065 3014.2716 3095.0134 3095.9317 3097.1031 3107.7350 3109.0976 3125.3588 3128.1708 3135.1025 3144.0880 3153.5334 3167.2483 3167.4868 3171.0223 3180.5223 3194.9292 3404.1075
redmass: 4.6253 4.5651 5.1978 4.2506 4.2387 3.0836 4.0424 3.6221 3.6260 4.1196 1.7405 2.0161 4.7810 4.5167 4.3587 4.2313 3.8712 1.2283 1.3705 3.1737 4.4418 5.0143 4.2961 5.7494 4.6506 5.2013 3.9027 6.2610 4.6251 3.4931 5.5315 2.9950 2.9095 5.8224 6.5353 3.3712 5.9291 3.1144 5.8445 7.0111 2.1590 4.7348 4.5359 6.1090 3.3089 3.2260 5.8822 2.9173 3.3530 4.5476 1.4290 4.6738 1.3815 1.4321 2.7575 1.1227 1.1189 5.9320 1.7408 4.7913 1.5562 3.8839 1.6203 3.4228 1.3987 6.8868 1.5571 1.3708 1.3476 1.3280 3.1254 1.3119 2.2980 2.1448 2.6939 2.5852 4.9350 2.1559 2.2708 2.2044 2.1000 2.1938 1.4364 1.4409 1.2664 1.4496 1.4935 1.8132 1.9305 1.5164 2.8250 2.1678 1.3422 1.1419 1.3586 1.6954 3.9638 2.2049 2.3999 1.4014 1.4424 2.2956 1.7615 1.2609 3.4141 2.0842 4.9779 5.3120 2.4863 2.7133 1.0396 1.0398 1.9533 1.3302 1.0824 1.1451 1.0996 2.0647 6.6073 5.2762 6.1378 7.6068 2.5056 4.2668 6.1747 4.8096 6.4111 1.0553 1.0552 1.0861 1.0363 1.0363 1.1075 1.1076 1.0989 1.0989 1.0868 1.1014 1.1014 1.0863 1.0892 1.0877 1.0914 1.0939 1.0978 1.0936 1.0994 1.0902 1.0935 1.0731
irintensity: 0.0410 0.0670 0.5226 0.5337 3.1349 4.0380 1.4129 0.0355 5.1730 0.6966 1.4386 0.0327 1.4410 3.1515 6.9902 4.6316 6.2614 0.4739 0.0737 0.1519 1.9692 5.2287 3.9929 0.9860 0.9914 6.8728 6.7262 0.3303 3.1167 5.3341 1.3982 1.5386 0.3329 17.3194 5.9365 0.1119 25.5277 3.0441 5.0304 4.7650 2.5222 4.4517 0.7644 49.7748 35.2031 39.3520 2.9568 0.0677 6.0172 11.4232 90.2482 2.6126 86.1450 36.9798 0.4478 10.8364 0.0086 3.5986 3.6727 2.8164 10.0598 12.7735 0.6917 75.0247 19.9333 1.7230 24.1764 2.2358 3.7086 0.6205 23.9614 0.3599 5.9819 12.7616 107.6846 42.8721 62.1800 11.1608 2.3556 2.0858 134.0891 209.4436 4.4797 4.7335 0.8895 15.8250 26.9308 88.0441 104.2296 24.0589 47.9781 425.2271 134.5314 1.4022 16.1506 0.3630 18.2486 65.2064 64.5105 36.7699 18.4756 164.6460 45.0127 12.3763 46.1805 37.6022 194.0647 61.8161 16.4640 1.6596 7.9726 15.8584 28.2399 79.9948 17.1993 67.2064 21.1694 177.2228 87.8579 56.9218 51.9022 122.2229 94.8980 19.5528 134.0134 42.0791 12.1716 65.3935 20.0444 59.0375 21.6290 36.7919 24.3843 42.5165 27.8861 24.4861 13.4030 28.3402 35.1261 14.9597 13.0066 13.2435 20.0265 21.7413 30.6735 23.7798 34.9784 5.0243 21.8649 1.9045
temp: 298.150 k
press: 1.00000 atm
elementType: 8 8 7 7 7 6 6 6 6 6 6 6 6 6 6 6 6 6 6 6 6 6 6 6 6 6 6 6 6 1 1 1 1 1 1 1 1 1 1 1 1 1 1 1 1 1 1 1 1 1 1 1
symmnumber: 1
zpe: 1086323.1 jmol-1
zpe.correction: 0.413759 hartree
zpe.thermalcorrener: 0.439882 hartree
zpe.thermalcorrenthalpy: 0.440826 hartree
zpe.thermalcorrgfe: 0.351811 hartree
zpe.sumelectzpe: -1240.972552 hartree
zpe.sumelectthermal: -1240.946428 hartree
zpe.sumelectthermalent: -1240.945484 hartree
zpe.sumelectthermalfe: -1241.034499 hartree
dipole: 4.7867 -3.7101 -0.0845
dipole: 6.0568
quadrupole: -162.3808 -139.6368 -178.3944
quadrupole: 2.4394 -1.8241 0.7525
quadrupole: -2.2434 20.5005 -18.2571 2.4394 -1.8241 0.7525
hfenergy: -1241.3863107 hartree
pointgroup: C01 [X(C24H23N3O2)]
dipole: -2.042296 0.9344984 -0.7962465 debye
polarizability: 646.7510857|52.0846844|333.8853812|25.6917191|-112.0936784|196.969895 unknown
InChI: InChI=1S/C24H23N3O2/c1-3-28-22-14-13-17(15-23(22)29-4-2)16-25-27-24-18-9-5-7-11-20(18)26-21-12-8-6-10-19(21)24/h5-16,27H,3-4H2,1-2H3
charge 0 multiplicity 1
52 atoms
O  -4.342712 -1.829896 0.99193
O  -6.302646 -0.524745 -0.213191
N  5.188117 -0.1870 0.641315
N  1.32902 1.217878 -0.618479
N  0.080265 0.679422 -0.378371
C  2.545273 0.713043 -0.153843
C  3.715663 1.523044 -0.417472
C  2.706698 -0.541603 0.53471
C  5.013776 1.007559 -0.005603
C  4.067597 -0.929806 0.909638
C  3.678875 2.812324 -1.057254
C  1.634196 -1.44495 0.868254
C  6.196028 1.782639 -0.278313
C  4.2761 -2.177262 1.597573
C  4.842863 3.540026 -1.302451
C  1.880088 -2.64613 1.53089
C  6.120072 3.016926 -0.914401
C  3.213042 -3.018794 1.904854
C  -2.322176 0.844398 -0.740328
C  -3.952818 -0.729073 0.226706
C  -5.021631 -0.019708 -0.426719
C  -2.627607 -0.293731 0.065541
C  -0.949444 1.305214 -0.924672
C  -3.381726 1.537951 -1.375241
C  -4.717565 1.1098 -1.219664
C  -3.278349 -2.588964 1.68236
C  -7.432534 0.165168 -0.871875
C  -3.96668 -3.730166 2.424975
C  -8.694902 -0.599358 -0.484684
H  2.730214 3.277794 -1.354863
H  0.619545 -1.161682 0.589561
H  7.148198 1.350611 0.044353
H  5.30981 -2.422413 1.859573
H  1.378156 2.073974 -1.187205
H  4.78091 4.520704 -1.786561
H  1.044573 -3.314566 1.768781
H  7.028304 3.595896 -1.113852
H  3.390072 -3.965107 2.428277
H  -1.800566 -0.812434 0.555733
H  -0.810258 2.211038 -1.550984
H  -3.164654 2.414753 -1.996714
H  -5.517492 1.661522 -1.720963
H  -2.554701 -2.970845 0.932628
H  -2.741392 -1.915066 2.381261
H  -7.473487 1.217812 -0.523664
H  -7.275309 0.159338 -1.970164
H  -3.217332 -4.336167 2.966115
H  -4.69358 -3.336367 3.155368
H  -4.505062 -4.384776 1.718893
H  -9.580735 -0.128679 -0.948739
H  -8.634096 -1.646856 -0.824807
H  -8.828906 -0.598289 0.610182
