program: Gaussian 09
title: 000271938
version: EM64L-G09RevD.01
frameworkgroup: C1[X(C19H16N2O2)]
method: RPBEPBE
basis: SDD
operation: Freq
keyword: #p
keyword: freq=noraman
keyword: PBEPBE/SDD
title: #p freq=noraman PBEPBE/SDD
converged: YES YES NO NO
title: Mulliken charges:
elementType: O O N N C C C C C C C C C C C C C C C C C C C H H H H H H H H H H H H H H H H
charge: -0.290479 -0.211000 -0.405463 0.056083 0.188714 0.397184 0.151314 -0.394658 -0.433494 -0.385961 -0.425835 -0.238973 -0.251753 0.107663 -0.244695 0.284227 0.219102 -0.346664 -0.375478 -0.349911 -0.246296 -0.229029 -0.534613 0.273457 0.241617 0.270158 0.239664 0.234508 0.231753 0.231957 0.309593 0.286393 0.248811 0.239677 0.231681 0.226934 0.225103 0.224344 0.244367
chargesum: 0.00000
title: Mulliken charges with hydrogens summed into heavy atoms:
elementType: O O N N C C C C C C C C C C C C C C C C C C C
charge: -0.290479 -0.211000 -0.095870 0.056083 0.188714 0.397184 0.151314 -0.121201 -0.191877 -0.115803 -0.186171 -0.004465 -0.020000 0.107663 -0.012738 0.284227 0.219102 -0.060270 -0.126667 -0.110235 -0.014615 -0.002095 0.159200
polarizability: 4.05124803e+02 -1.06673415e+00 2.56149754e+02 2.98031388e+01 -8.50500958e+00 1.36785717e+02
1716.lowfreq: -2.6719 -0.0004 -0.0003 0.0004 2.4849 5.0168 18.4577 28.2356 32.4137
frequency: 18.4251 28.2115 32.3790 63.8084 80.1167 98.4269 105.1641 151.0605 163.6094 177.9770 182.4976 195.6730 235.3557 238.9735 271.3799 272.2732 326.0930 338.5683 361.7552 399.7014 407.1518 449.2394 472.6365 481.4865 496.3118 508.2259 525.1952 544.4272 556.0756 574.3972 623.5688 639.1918 651.3284 656.1022 715.1344 743.3186 756.2988 759.9860 761.2152 783.6398 788.8704 790.4619 826.2547 842.3928 861.2141 888.6057 898.3758 936.7720 949.1080 958.8305 972.2729 988.6345 992.1888 994.1194 998.9261 1002.4291 1025.2571 1041.4865 1044.7236 1078.4107 1105.2756 1114.2584 1139.8040 1151.8136 1156.1379 1174.6604 1178.4970 1192.1832 1207.4342 1235.4435 1236.2753 1241.3750 1282.4124 1296.3795 1325.1311 1368.8142 1388.7959 1401.2891 1411.3254 1430.6088 1439.8866 1448.0304 1451.5729 1467.2464 1468.2194 1482.9683 1501.1690 1514.4604 1560.4138 1583.6553 1590.4016 1592.9785 1607.0776 1617.1095 1629.7317 2962.8976 3022.0437 3052.5782 3123.3650 3125.4328 3127.5379 3133.7629 3134.6541 3147.9928 3150.0771 3151.0108 3163.8902 3165.3465 3166.4873 3173.5204 3368.8225
redmass: 4.7612 5.5678 5.2880 6.0443 5.1281 3.7700 4.0470 4.7759 5.6708 4.5243 3.9461 3.0891 1.7390 3.4050 2.7735 3.3049 6.7853 4.5899 5.6656 5.3344 4.2059 3.9393 3.3151 3.2134 6.5431 5.6025 6.9352 3.5176 4.2286 4.9764 4.0936 2.0287 2.8088 3.0165 3.7711 3.5331 1.6759 3.7391 1.3115 6.3320 5.4373 1.8687 1.6775 4.8374 1.4105 1.6931 4.9241 1.4137 1.3767 1.4723 1.3824 8.6777 1.4444 1.3468 1.3401 4.9446 3.2174 2.5014 2.5275 2.5126 2.2388 1.2575 2.1058 1.3846 1.4264 1.0938 1.1053 1.4037 1.9726 2.3640 1.8825 1.9882 1.8985 1.5453 1.7409 2.4860 6.2371 2.6422 6.2692 1.4787 2.4489 1.7047 2.3675 1.0623 1.3182 1.5754 1.9466 3.7750 6.3001 7.3171 6.1603 5.5301 6.3654 7.1951 6.6303 1.0327 1.0879 1.1042 1.0865 1.0997 1.0873 1.0859 1.0885 1.0918 1.0900 1.0943 1.0940 1.1002 1.0987 1.0997 1.0758
irintensity: 0.0364 0.8647 1.1268 2.0330 2.2289 12.4604 1.2142 0.4199 1.8758 1.4431 2.2294 10.1226 8.0601 2.6400 3.1091 4.6528 5.4190 1.0740 19.1107 2.3555 0.5311 10.5648 0.9395 4.2894 3.2450 9.2608 2.6556 0.5357 14.0029 2.6209 2.7616 38.9677 14.6168 44.1350 4.7354 0.2876 8.7068 8.4537 88.1726 14.5852 2.4590 76.3890 48.9094 2.5035 0.0856 7.7907 20.8306 1.2943 3.2091 26.3531 2.8410 47.4254 1.6042 2.1152 1.2083 6.8635 5.4475 14.1993 11.9363 95.1373 32.1933 0.1256 131.4854 0.5590 71.4961 15.1133 11.7769 88.5105 35.6974 208.6245 6.4621 100.6915 37.6856 19.1000 28.4776 4.8328 47.2637 3.3393 0.4993 27.8399 1.5783 27.5933 2.9629 16.3442 75.0698 27.8106 273.2909 12.7207 2.3678 22.8790 42.8209 6.3290 43.5804 167.4266 8.2460 80.5472 40.8906 43.4983 1.8359 19.2914 3.1309 0.7825 5.7495 12.7339 11.3822 31.8171 14.4546 35.8268 10.4519 27.8262 8.3266
temp: 298.150 k
press: 1.00000 atm
elementType: 8 8 7 7 6 6 6 6 6 6 6 6 6 6 6 6 6 6 6 6 6 6 6 1 1 1 1 1 1 1 1 1 1 1 1 1 1 1 1
symmnumber: 1
zpe: 794846.6 jmol-1
zpe.correction: 0.302741 hartree
zpe.thermalcorrener: 0.322319 hartree
zpe.thermalcorrenthalpy: 0.323263 hartree
zpe.thermalcorrgfe: 0.252768 hartree
zpe.sumelectzpe: -991.947078 hartree
zpe.sumelectthermal: -991.927500 hartree
zpe.sumelectthermalent: -991.926556 hartree
zpe.sumelectthermalfe: -991.997051 hartree
dipole: -1.2324 6.0448 2.2704
dipole: 6.5737
quadrupole: -93.9953 -130.0101 -134.2432
quadrupole: -4.0654 3.6033 -3.2306
quadrupole: 25.4209 -10.5939 -14.8270 -4.0654 3.6033 -3.2306
hfenergy: -992.2498188 hartree
pointgroup: C01 [X(C19H16N2O2)]
dipole: 0.4092008 0.4570652 2.5124773 debye
polarizability: 404.338121|-32.3945225|144.270223|0.5201287|-29.5271503|249.4519297 unknown
InChI: InChI=1S/C19H16N2O2/c1-23-18-12-5-3-8-15(18)13-20-21-19(22)17-11-6-9-14-7-2-4-10-16(14)17/h2-13,21H,1H3
charge 0 multiplicity 1
39 atoms
O  3.73411 0.62548 2.018653
O  -0.988699 0.076439 -2.970098
N  -0.250616 0.327675 -0.751539
N  1.083157 0.115518 -1.052881
C  -3.190826 -0.099169 -0.03634
C  -4.522749 0.297349 0.388903
C  -2.641445 0.508227 -1.230462
C  -2.514469 -1.11656 0.724043
C  -5.267255 1.238271 -0.394858
C  -3.424657 1.388755 -1.992269
C  -5.086507 -0.281939 1.574282
C  -4.736892 1.758836 -1.576626
C  -3.097196 -1.67084 1.866719
C  -1.243535 0.253988 -1.749285
C  -4.387052 -1.239934 2.309011
C  3.376916 0.070823 -0.290697
C  4.30072 0.250273 0.787775
C  3.886767 -0.308681 -1.562234
C  1.944464 0.280835 -0.066189
C  5.687789 0.053223 0.589683
C  5.266176 -0.505846 -1.763516
C  6.164847 -0.324272 -0.685445
C  4.635719 0.831629 3.15443
H  -1.546797 -1.495024 0.379424
H  -6.269486 1.529395 -0.058487
H  -3.000559 1.797242 -2.91526
H  -6.089386 0.033486 1.886356
H  -5.317545 2.460935 -2.183855
H  -2.56858 -2.453496 2.421921
H  -4.82847 -1.679026 3.210109
H  -0.53646 0.596476 0.203624
H  3.168132 -0.440702 -2.377384
H  1.640081 0.582206 0.95266
H  6.396316 0.189504 1.411646
H  5.640976 -0.797542 -2.749825
H  7.239958 -0.475413 -0.833208
H  5.360056 1.643421 2.949453
H  5.180178 -0.098167 3.409225
H  3.982316 1.119825 3.990938
