program: Gaussian 09
title: 000271935
version: EM64L-G09RevD.01
frameworkgroup: C1[X(C11H17N3O6)]
method: RPBEPBE
basis: SDD
operation: Freq
keyword: #p
keyword: freq=noraman
keyword: PBEPBE/SDD
title: #p freq=noraman PBEPBE/SDD
converged: YES YES NO NO
title: Mulliken charges:
elementType: O O O O O O N N N C C C C C C C C C C C H H H H H H H H H H H H H H H H H
charge: -0.293821 -0.441545 -0.469923 -0.434992 -0.292120 -0.231715 -0.171413 -0.626365 -0.403216 -0.162199 -0.190262 -0.040243 -0.192209 -0.041872 -0.369907 -0.242203 0.276439 0.258694 0.077473 -0.759043 0.308520 0.255140 0.238016 0.253722 0.229202 0.214429 0.225182 0.269796 0.311428 0.359887 0.388460 0.262045 0.366478 0.352050 0.213769 0.252124 0.250193
chargesum: 0.00000
title: Mulliken charges with hydrogens summed into heavy atoms:
elementType: O O O O O O N N N C C C C C C C C C C C
charge: -0.293821 -0.081658 -0.081464 -0.082942 -0.292120 -0.231715 -0.171413 -0.045142 -0.036738 0.146321 0.064878 0.197774 0.061512 0.187330 0.069705 0.019842 0.276439 0.258694 0.077473 -0.042956
polarizability: 2.20836679e+02 -5.03099395e+00 1.24982130e+02 3.20479944e+00 4.42270495e+00 1.38674971e+02
1716.lowfreq: -0.0009 -0.0009 -0.0007 3.1536 6.8216 9.6879 39.3487 47.1652 60.9514
frequency: 39.2892 47.1630 60.9376 78.0295 92.3533 115.7680 122.9580 156.9615 158.6315 178.9286 192.9209 204.5664 231.3613 248.3728 259.4650 265.3186 278.8515 293.1580 331.6348 342.5884 369.7464 381.5253 394.2369 421.2755 439.1408 447.8485 457.8718 508.4452 523.2697 558.3576 579.1177 638.2611 673.6469 704.2546 706.0094 717.7558 719.7853 737.7497 748.8325 772.4312 786.4976 827.8428 842.3067 855.8908 886.6085 928.9414 958.5261 984.1332 993.5470 1013.7432 1016.6201 1040.5641 1050.7118 1052.4598 1089.9928 1100.1159 1126.2893 1127.6595 1141.9313 1186.2310 1196.5961 1225.7835 1227.6975 1250.1694 1255.8847 1261.4678 1272.5739 1292.1342 1308.6170 1315.6531 1326.7282 1343.1832 1346.1859 1361.5548 1371.8923 1382.7037 1385.0171 1385.8015 1397.4996 1407.2688 1416.0368 1449.9838 1463.0507 1471.4697 1619.0352 1627.9173 1656.0999 1664.1644 2960.7583 2979.6792 2989.5729 2997.8706 3000.1415 3035.0121 3051.4431 3071.5720 3087.0188 3098.1891 3168.0864 3273.5485 3436.2800 3485.9868 3518.0443 3552.1783 3552.3543
redmass: 6.5059 5.4521 4.8722 6.8134 3.6574 1.0578 5.6701 5.4090 3.8358 6.8867 4.6598 4.8302 4.0153 1.7996 4.4262 2.3182 3.0900 4.3905 5.1973 4.6198 5.1018 8.4469 3.3038 1.9287 2.1984 3.9229 5.4924 1.1217 3.8264 5.9680 4.8976 4.1409 3.2982 4.3388 2.7162 3.6029 1.3970 1.4344 4.0096 4.4543 2.0462 4.1086 3.3936 3.1806 1.3672 2.3462 3.5264 3.0825 3.5519 3.0022 1.8606 3.1870 1.4693 3.7242 2.6685 2.3462 3.2274 2.6831 5.2910 1.3378 1.3599 1.3818 4.3375 1.4403 1.2774 1.3003 1.7138 1.3818 1.4588 1.6403 1.6925 1.2591 1.5266 1.6278 1.3168 1.4842 1.3626 1.3140 1.2789 1.3043 3.0331 1.0432 1.0862 1.0731 5.1038 10.5750 1.1080 5.6673 1.0835 1.0816 1.0364 1.0641 1.0862 1.0852 1.0870 1.0975 1.1003 1.1006 1.0938 1.0697 1.0459 1.0649 1.0770 1.0960 1.0654
irintensity: 0.3611 2.7482 5.6580 0.1363 2.6526 0.3596 1.0959 3.9650 5.4272 0.9546 4.4195 4.6398 7.5762 54.2793 4.0108 15.0179 9.9829 10.1001 2.3987 3.3708 2.2715 11.4691 26.0496 43.6087 69.0626 33.0638 30.9428 90.9195 13.9012 22.3397 5.7165 1.7073 15.9254 4.0659 8.6263 27.4713 139.4290 116.0863 29.1391 14.9881 116.2357 24.7595 86.9367 18.5132 19.0418 9.9137 82.3885 116.8007 4.1536 46.3851 39.5160 79.4009 7.0938 58.2941 55.3390 18.5540 32.1905 44.6032 32.0146 16.7401 32.5217 61.4279 27.9900 59.1336 3.7686 6.4835 24.1644 8.3642 32.2021 43.8306 22.2436 24.3109 14.4661 63.8287 21.3600 7.4138 6.4657 29.4336 68.5497 42.3954 53.8811 12.8687 7.2940 3.2553 354.1155 201.3660 66.4609 614.5618 27.5085 1.9998 18.7149 33.9364 23.8590 21.5858 47.3082 11.1054 30.7914 13.1608 4.1703 435.0330 6.9238 20.0571 62.5244 6.6705 7.3403
temp: 298.150 k
press: 1.00000 atm
elementType: 8 8 8 8 8 8 7 7 7 6 6 6 6 6 6 6 6 6 6 6 1 1 1 1 1 1 1 1 1 1 1 1 1 1 1 1 1
symmnumber: 1
zpe: 766503.3 jmol-1
zpe.correction: 0.291946 hartree
zpe.thermalcorrener: 0.311642 hartree
zpe.thermalcorrenthalpy: 0.312586 hartree
zpe.thermalcorrgfe: 0.244479 hartree
zpe.sumelectzpe: -1043.428863 hartree
zpe.sumelectthermal: -1043.409167 hartree
zpe.sumelectthermalent: -1043.408222 hartree
zpe.sumelectthermalfe: -1043.476330 hartree
dipole: -1.1824 -2.3672 -3.0920
dipole: 4.0697
quadrupole: -134.9135 -128.3025 -118.5357
quadrupole: 1.3361 7.1369 1.5429
quadrupole: -7.6630 -1.0519 8.7149 1.3361 7.1369 1.5429
hfenergy: -1043.7208088 hartree
pointgroup: C01 [X(C11H17N3O6)]
dipole: 0.5066511 0.7170192 -1.338953 debye
polarizability: 220.5343159|-8.0113943|124.3116284|-1.0999228|-2.1604524|139.6478357 unknown
InChI: InChI=1S/C11H17N3O6/c1-4-2-14(11(19)13-9(4)18)10-6(12)8(17)7(16)5(3-15)20-10/h2,5-8,10,13,15-17H,3,12H2,1H3
charge 0 multiplicity 1
37 atoms
O  -1.215803 -1.083547 -0.408878
O  -3.37426 2.632279 -0.205118
O  -2.91044 0.34931 1.515422
O  -2.503377 -3.570004 -0.452723
O  -0.05317 0.25389 1.842136
O  4.547907 -0.286012 1.32752
N  0.80577 0.060475 -0.360087
N  -0.776942 2.451732 -1.677869
N  2.23539 -0.02282 1.511173
C  -1.23978 1.490286 -0.657485
C  -2.783881 1.390708 -0.712478
C  -0.555322 0.110342 -0.944601
C  -3.271398 0.176311 0.104335
C  -2.699225 -1.108103 -0.517886
C  -3.112551 -2.403216 0.189312
C  1.925429 -0.133536 -1.182725
C  0.924013 0.103802 1.048567
C  3.209757 -0.251214 -0.708886
C  3.430841 -0.193403 0.745325
C  4.410168 -0.446149 -1.600243
H  -0.984504 1.801364 0.375539
H  -3.122234 1.317787 -1.762545
H  -0.449145 0.034022 -2.045416
H  -4.375318 0.146473 0.089949
H  -2.979924 -1.163442 -1.592327
H  -4.201828 -2.548772 0.097598
H  -2.845496 -2.336608 1.262528
H  0.158838 2.829879 -1.491234
H  -1.454405 3.213938 -1.805944
H  -3.348121 2.564079 0.788636
H  -1.921275 0.208481 1.643462
H  1.704498 -0.178818 -2.25249
H  2.348375 0.00705 2.53031
H  -1.522156 -3.424686 -0.451844
H  4.12369 -0.472267 -2.665321
H  4.932246 -1.387361 -1.350412
H  5.144232 0.365748 -1.449295
