program: Gaussian 09
title: 000271921
version: EM64L-G09RevD.01
frameworkgroup: C1[X(C12H14N6)]
method: RPBEPBE
basis: SDD
operation: Freq
keyword: #pfreq=noraman
keyword: PBEPBE/SDD
title: #p freq=noraman PBEPBE/SDD
converged: YES YES NO NO
title: Mulliken charges:
elementType: N N N N N N C C C C C C C C C C C C H H H H H H H H H H H H H H
charge: -0.317757 -0.085598 -0.163936 -0.625284 -0.612362 -0.015206 0.187362 -0.673148 -0.722799 0.374305 0.210039 -0.016829 -0.500898 -0.345889 0.424022 -0.194365 -0.395899 -0.266016 0.237935 0.236901 0.198545 0.247137 0.220597 0.234821 0.274343 0.268104 0.338539 0.337828 0.240046 0.262875 0.319480 0.323108
chargesum: 0.00000
title: Mulliken charges with hydrogens summed into heavy atoms:
elementType: N N N N N N C C C C C C C C C C C C
charge: -0.317757 -0.085598 -0.163936 0.051083 0.030226 -0.015206 0.187362 0.000233 -0.020243 0.374305 0.210039 -0.016829 -0.226555 -0.077785 0.424022 0.045681 -0.133024 -0.266016
polarizability: 2.70312229e+02 -1.04415426e+01 1.57768602e+02 6.02347907e+00 -9.60078772e+00 1.17633554e+02
1716.lowfreq: -8.5145 -4.1699 0.0002 0.0003 0.0006 7.8128 22.0860 44.2805 76.8516
frequency: 22.0469 44.2652 76.8502 94.6430 120.2963 147.1791 151.2172 191.1515 210.0315 238.3924 255.7711 264.2788 284.9923 309.4020 318.0791 361.2723 384.1530 386.8412 391.2148 423.7340 450.8630 469.2612 487.6719 511.2465 518.8943 524.3190 539.3241 547.5479 563.3039 615.1757 634.1802 666.3341 682.9483 698.3350 724.8748 802.1261 812.6747 816.2431 863.0553 909.8692 915.9334 927.6363 944.7846 969.3820 985.9053 992.5928 994.0318 1047.6414 1092.8844 1104.7311 1120.3733 1130.7846 1168.4504 1182.1164 1193.7899 1244.1127 1284.5906 1297.8537 1369.8883 1370.2466 1390.1298 1397.7871 1413.0666 1433.8892 1448.4005 1461.1290 1468.5925 1469.9685 1477.0243 1539.5150 1570.3400 1573.7429 1598.3634 1613.4384 1620.5738 2180.2526 2983.6390 3002.7907 3081.6597 3095.7361 3104.4142 3113.3830 3143.5565 3160.8270 3170.2823 3175.8510 3549.4027 3567.1311 3703.3428 3728.6613
redmass: 5.0469 5.0385 4.3979 6.1809 4.4134 5.3186 4.5350 5.0961 1.2764 2.4061 1.4540 2.5324 3.0175 2.6595 2.9071 3.1916 1.6474 1.3027 2.1053 2.8309 7.2088 3.3844 3.0292 1.7014 4.0370 1.2687 1.8442 4.3854 5.9476 5.5425 5.4504 7.6194 5.7751 2.1532 10.1471 3.1676 1.7013 6.4619 3.0010 1.5394 1.5843 1.4067 1.8264 3.3145 3.9400 1.3532 1.5847 2.9344 1.6957 1.9091 2.1214 2.0263 2.2043 1.1196 3.2854 4.0816 3.7356 1.4492 4.1068 1.4027 1.4977 2.5436 3.7155 4.5902 1.0555 1.0842 1.1125 2.0542 1.1173 2.4372 1.7468 5.6199 4.5656 2.6428 2.1427 12.6328 1.0351 1.0356 1.0998 1.0998 1.1006 1.0992 1.0871 1.0932 1.0931 1.0991 1.0445 1.0438 1.1051 1.1058
irintensity: 2.8350 0.4335 0.3107 1.6327 1.0038 2.8149 2.0037 3.8560 0.2021 1.4484 0.7224 0.6032 0.7123 8.7771 0.8350 13.8551 2.0306 285.3157 54.1923 47.1615 2.0803 24.8145 26.3752 35.5645 2.1529 33.3686 40.9032 9.4115 3.0008 6.8726 0.9827 10.8021 3.2005 26.6981 21.4471 6.2750 50.0758 45.5096 4.0298 4.2539 1.1308 8.4357 10.0035 10.3362 4.6439 0.2364 1.3609 10.9098 9.5592 2.8342 2.5411 40.6593 8.3094 0.6599 40.9484 19.5937 149.9796 18.1686 16.6994 28.7877 73.4285 300.2614 54.1107 220.7045 3.1526 5.9014 14.3045 31.4556 29.6332 268.9081 177.8731 56.8594 255.7722 480.7748 378.4530 31.6167 18.4085 16.0078 28.5093 13.5206 25.6581 23.7377 6.4565 3.2952 3.2128 4.8309 62.3404 98.1163 44.8026 39.7678
temp: 298.150 k
press: 1.00000 atm
elementType: 7 7 7 7 7 7 6 6 6 6 6 6 6 6 6 6 6 6 1 1 1 1 1 1 1 1 1 1 1 1 1 1
symmnumber: 1
zpe: 658476.5 jmol-1
zpe.correction: 0.250800 hartree
zpe.thermalcorrener: 0.267958 hartree
zpe.thermalcorrenthalpy: 0.268902 hartree
zpe.thermalcorrgfe: 0.206283 hartree
zpe.sumelectzpe: -792.888751 hartree
zpe.sumelectthermal: -792.871593 hartree
zpe.sumelectthermalent: -792.870649 hartree
zpe.sumelectthermalfe: -792.933268 hartree
dipole: 1.6281 -4.2338 0.5148
dipole: 4.5652
quadrupole: -119.4620 -99.7727 -105.5445
quadrupole: 10.7509 -7.2956 1.6271
quadrupole: -11.2023 8.4870 2.7153 10.7509 -7.2956 1.6271
hfenergy: -793.1395511 hartree
pointgroup: C01 [X(C12H14N6)]
dipole: -0.6338399 -1.3828834 0.9548552 debye
polarizability: 269.3256747|3.0076929|150.3363052|-17.2133057|-17.8189748|126.0524051 unknown
InChI: InChI=1S/C12H14N6/c1-12(2)17-10(14)16-11(15)18(12)9-5-3-4-8(6-9)7-13/h3-6H,14-15H2,1-2H3
charge 0 multiplicity 1
32 atoms
N  -0.720241 -0.095392 0.074136
N  -2.872575 0.363197 -1.07075
N  -2.784483 -0.198002 1.315954
N  -0.777887 -0.737071 2.369786
N  -4.802756 -0.189182 0.1449
N  5.033364 1.413656 -0.874423
C  -1.445717 0.726141 -1.027513
C  -1.309607 2.236853 -0.691674
C  -0.840875 0.395474 -2.404521
C  0.614929 -0.594365 -0.074738
C  -1.45862 -0.33374 1.237556
C  -3.437455 0.018787 0.078729
C  1.706523 0.283064 -0.287675
C  0.855131 -1.996764 -0.023484
C  3.017243 -0.235901 -0.464411
C  2.160739 -2.507141 -0.18065
C  3.248692 -1.637741 -0.408153
C  4.11838 0.666007 -0.689517
H  -1.895653 2.818899 -1.42369
H  -1.712376 2.444992 0.315524
H  -0.258644 2.576682 -0.736028
H  -1.457871 0.904844 -3.16219
H  0.20284 0.735585 -2.508984
H  -0.894083 -0.689389 -2.59741
H  1.544541 1.364101 -0.309817
H  0.007508 -2.672653 0.12949
H  -1.342394 -0.945192 3.189999
H  0.234992 -0.687051 2.438658
H  2.328784 -3.588403 -0.142799
H  4.261942 -2.027588 -0.543216
H  -5.368427 -0.040899 -0.685572
H  -5.208745 -0.512914 1.017382
