program: Gaussian 09
title: 000271884
version: EM64L-G09RevD.01
frameworkgroup: C1[X(C3H7N3O)]
method: RPBEPBE
basis: SDD
operation: Freq
keyword: #pfreq=noraman
keyword: PBEPBE/SDD
title: #p freq=noraman PBEPBE/SDD
converged: NO YES YES YES
title: Mulliken charges:
elementType: O N N N C C C H H H H H H H
charge: -0.251718 -0.397143 0.082382 -0.651695 0.306356 -0.188617 -0.693648 0.257876 0.191453 0.256924 0.222753 0.222744 0.298310 0.344022
chargesum: 0.00000
title: Mulliken charges with hydrogens summed into heavy atoms:
elementType: O N N N C C C
charge: -0.251718 -0.139267 0.082382 -0.009362 0.306356 0.002836 0.008772
polarizability: 1.01627232e+02 1.22448653e+00 5.91850759e+01 -1.65942010e-03 1.68297476e-03 3.06917466e+01
1716.lowfreq: -1.6039 -0.0001 0.0007 0.0008 3.7731 18.8175 49.2279 109.6313 139.4098
frequency: 49.0861 109.6271 139.4097 182.6486 262.3900 341.2256 351.7674 383.7713 480.6874 543.0422 571.4525 631.8077 709.5698 878.4754 920.5610 939.6465 1039.7215 1046.3271 1115.3348 1152.7341 1286.2207 1333.9440 1392.8345 1458.4158 1461.0037 1509.7613 1603.2038 1623.8257 1682.8472 2945.7957 2976.1135 3048.3305 3114.2075 3366.4749 3539.9253 3698.6488
redmass: 1.7378 3.0887 4.0889 1.3221 1.7649 4.2064 1.9803 3.8689 1.1190 2.9055 1.2402 5.1195 8.3560 1.2966 2.5715 2.0330 2.2680 1.4978 4.2469 2.3741 1.8935 1.5710 1.2572 1.0756 1.0473 1.8244 1.2097 6.0846 5.4976 1.0837 1.0400 1.0973 1.0981 1.0749 1.0460 1.1035
irintensity: 0.9769 5.3105 9.0902 0.3934 2.8726 2.3357 103.9137 1.9220 228.5768 7.1562 128.4440 11.4803 17.1098 43.5205 0.3910 2.7504 22.1095 0.1515 160.2076 0.9191 307.0626 64.8286 12.6266 19.3100 19.8234 294.4875 110.7010 0.7262 321.3763 71.9995 29.0468 26.0928 13.3596 18.2556 40.0746 41.2553
temp: 298.150 k
press: 1.00000 atm
elementType: 8 7 7 7 6 6 6 1 1 1 1 1 1 1
symmnumber: 1
zpe: 286450.8 jmol-1
zpe.correction: 0.109103 hartree
zpe.thermalcorrener: 0.117441 hartree
zpe.thermalcorrenthalpy: 0.118385 hartree
zpe.thermalcorrgfe: 0.076055 hartree
zpe.sumelectzpe: -357.419510 hartree
zpe.sumelectthermal: -357.411172 hartree
zpe.sumelectthermalent: -357.410228 hartree
zpe.sumelectthermalfe: -357.452558 hartree
dipole: -0.4449 -5.9421 0.0002
dipole: 5.9587
quadrupole: -29.2128 -41.7907 -43.8818
quadrupole: -6.7427 0.0010 -0.0004
quadrupole: 9.0823 -3.4956 -5.5867 -6.7427 0.0010 -0.0004
hfenergy: -357.5286132 hartree
pointgroup: C01 [X(C3H7N3O1)]
dipole: -0.2376728 2.3322528 -0.0000598 debye
dipolederiv: -0.7060982 0.1179114 0.0000106 0.301865 -1.0720103 0.0002022 0.0002091 -0.0003737 -0.377112 -1.664666 0.2946623 0.0000399 -0.1003387 -0.0816792 -0.00018 -0.0000631 0.00001 -0.3750656 0.7763523 -0.0222851 0.0001081 0.649949 -0.2866034 0.0000846 0.000113 0.0000252 -0.0894564 -1.1720131 -0.4071202 -0.0002449 -0.5212272 -0.5642847 0.0001286 0.0000585 0.0002614 -0.8036273 2.4590007 0.0123794 -0.0001099 -0.396494 1.5835896 -0.0002231 -0.0004298 0.0000591 0.3645064 0.1143045 -0.0076665 0.0000549 0.2334428 0.4579081 0.0000354 0.0000119 -0.0000166 -0.1889994 -0.1979501 -0.0497501 -0.0000287 0.001132 -0.047347 0.0000032 -0.0001023 0.0000128 0.091133 -0.0213886 0.0127677 -0.0000387 -0.1039473 -0.0848511 0.0000118 -0.0000964 0.0000494 0.345172 -0.0312666 -0.0743897 -0.000019 -0.0083207 -0.2508803 0.0000113 -0.0000301 -0.0000035 0.1892422 0.0976922 0.0654475 -0.0000236 -0.0225059 -0.0866399 0.0000584 0.0000173 0.0000627 0.1253382 -0.0421633 0.0088759 -0.0999823 -0.0287925 0.0934232 0.0715031 -0.1475173 0.0477234 -0.0505498 -0.0422522 0.0089467 0.1000004 -0.0286828 0.0933595 -0.0715828 0.1475377 -0.0477914 -0.0503709 0.1986433 0.0295915 0.0001459 0.0277724 0.0760238 -0.0000384 0.0001613 -0.0000235 0.4131463 0.2318049 0.010629 0.0000874 -0.0038521 0.1699916 -0.0000143 0.00013 0.0000047 0.4066434 unknown
polarizability: 101.66236|-0.0850962|59.1499482|0.0016137|0.0017269|30.6917466 unknown
InChI: InChI=1S/C3H7N3O/c1-2-5-6-3(4)7/h2,6H,4H2,1H3
charge 0 multiplicity 1
14 atoms
O  1.707599 -1.309326 -0.000143
N  0.29879 0.596279 0.000349
N  -0.868277 -0.149793 0.000176
N  2.62568 0.834465 -0.000043
C  1.552871 -0.062849 0.000457
C  -2.007042 0.499123 0.000005
C  -3.308178 -0.256944 -0.000129
H  0.260404 1.627109 0.000232
H  -2.062142 1.609919 -0.000022
H  -3.114477 -1.341301 0.000186
H  -3.915273 -0.003363 -0.890589
H  -3.915744 -0.002895 0.88987
H  2.532486 1.847928 0.000109
H  3.555902 0.42485 -0.000559
