program: Gaussian 09
title: 000271928
version: EM64L-G09RevD.01
frameworkgroup: C1[X(C14H11FN2O5S)]
method: RPBEPBE
basis: SDD
operation: Freq
keyword: #p
keyword: freq=noraman
keyword: PBEPBE/SDD
title: #p freq=noraman PBEPBE/SDD
converged: YES YES NO NO
title: Mulliken charges:
elementType: S F O O O O O N N C C C C C C C C C C C C C C H H H H H H H H H H H
charge: 1.084926 -0.342149 -0.239390 -0.480329 -0.471815 -0.198316 -0.198196 -0.461752 0.029962 -0.654157 0.408373 0.519595 0.197646 -0.051554 -0.452961 -0.372179 -0.339997 -0.339862 -0.252008 -0.184904 0.367040 -0.348626 -0.346537 0.263034 0.266061 0.346023 0.286515 0.258070 0.256667 0.321926 0.290775 0.250862 0.293984 0.293274
chargesum: 0.00000
title: Mulliken charges with hydrogens summed into heavy atoms:
elementType: S F O O O O O N N C C C C C C C C C C C C C C
charge: 1.084926 -0.342149 -0.239390 -0.480329 -0.471815 -0.198316 -0.198196 -0.115729 0.029962 -0.125062 0.408373 0.519595 0.197646 -0.051554 -0.166446 -0.114109 -0.083330 -0.017936 0.038767 0.065959 0.367040 -0.054642 -0.053263
polarizability: 2.54118072e+02 2.41067803e+01 2.54836281e+02 1.57644985e+00 8.87836224e+00 1.51407667e+02
1716.lowfreq: -5.2636 -0.0018 -0.0012 -0.0011 3.1418 4.5981 9.2056 19.7825 20.1133
frequency: 8.6890 19.5896 20.1067 26.2729 51.5539 66.3451 73.1584 76.7549 105.1672 117.1492 170.3643 194.9204 204.7899 219.1878 239.2114 254.2255 270.6879 303.5096 306.6877 316.6498 331.3944 401.6804 407.9715 410.6583 433.0277 442.6255 472.3423 504.2030 516.1356 536.2622 560.6896 588.2264 627.1953 639.5418 643.6112 670.3586 681.3351 686.1438 690.5322 740.8484 774.3237 801.7155 823.7427 842.8069 857.5716 859.3139 878.6277 886.5737 923.5809 933.7767 935.4617 971.4905 989.5187 994.7907 998.1955 1005.6541 1010.8570 1065.9696 1092.2923 1092.9284 1108.2611 1165.4690 1180.7291 1182.4017 1188.9693 1215.3882 1219.2188 1251.1227 1290.9057 1303.2439 1308.8006 1369.6283 1370.3967 1397.3063 1418.0084 1425.6429 1450.8217 1475.1158 1481.3724 1504.3896 1572.5485 1594.7377 1605.5128 1616.7160 1627.2920 3010.2395 3072.6470 3138.2456 3138.6018 3143.7313 3158.0400 3178.3697 3183.2306 3185.3367 3195.9306 3490.0728
redmass: 6.8401 5.5510 14.3743 9.0120 9.8081 7.1400 9.7059 4.9499 8.7368 8.6669 8.1344 10.5301 4.9483 7.9859 9.9205 4.0149 6.6540 10.2329 11.2743 12.4238 2.5688 6.8059 3.4036 4.3918 7.4211 4.1754 6.2705 6.6632 4.3407 6.3694 7.1553 4.3056 6.8984 6.4969 6.2063 5.1931 2.1438 1.4352 3.7573 4.9022 7.3468 1.3096 4.8402 4.2760 1.2480 6.1205 2.4421 1.5285 2.0578 3.2282 1.6729 5.4292 1.3400 15.2368 1.3688 3.0812 1.3366 2.2685 3.1498 1.5939 1.3333 1.8279 1.0972 1.3536 1.6117 2.8494 4.3739 1.7028 1.5633 1.2864 1.5261 4.3208 6.3753 7.9706 3.4794 3.7379 1.1182 2.5915 2.4414 2.1990 5.1495 7.6289 6.2236 5.8910 6.4369 1.0624 1.0986 1.0909 1.0927 1.0911 1.0887 1.0960 1.0943 1.0955 1.0963 1.0766
irintensity: 0.2944 0.1196 0.1474 0.2124 11.6882 0.0429 6.4038 1.0682 0.4218 1.5570 0.3560 2.8757 0.5247 1.6422 5.3898 0.8391 9.2361 11.0177 4.3788 6.1516 1.0051 6.3881 1.2101 2.6595 41.5111 35.6429 6.5039 2.0997 46.8209 55.6278 58.8239 9.8378 0.2301 0.7401 2.7374 17.8221 47.9304 32.2784 25.3918 3.8188 25.7791 50.1670 5.7624 63.1693 0.4428 42.2372 18.5838 32.9482 2.9666 6.8251 7.6057 4.4100 4.0783 82.2942 0.1616 4.3535 3.3540 8.7113 25.9515 12.8619 20.2119 86.7800 2.9393 79.0155 38.5907 47.9785 219.1309 19.0312 33.2776 0.7116 53.2804 98.3007 77.0678 0.8416 54.4491 36.9804 31.5661 91.9546 8.0836 438.7215 129.0790 5.1964 108.9589 62.4857 188.9304 6.6453 1.3333 6.9198 7.5236 4.2671 7.3888 8.8660 0.4914 4.8285 7.3650 67.2661
temp: 298.150 k
press: 1.00000 atm
elementType: 16 9 8 8 8 8 8 7 7 6 6 6 6 6 6 6 6 6 6 6 6 6 6 1 1 1 1 1 1 1 1 1 1 1
symmnumber: 1
zpe: 610020.4 jmol-1
zpe.correction: 0.232344 hartree
zpe.thermalcorrener: 0.253655 hartree
zpe.thermalcorrenthalpy: 0.254599 hartree
zpe.thermalcorrgfe: 0.176870 hartree
zpe.sumelectzpe: -1521.737663 hartree
zpe.sumelectthermal: -1521.716353 hartree
zpe.sumelectthermalent: -1521.715409 hartree
zpe.sumelectthermalfe: -1521.793138 hartree
dipole: -1.7042 7.7182 -1.0089
dipole: 7.9682
quadrupole: -160.2450 -169.9768 -138.9627
quadrupole: -1.2422 3.2956 0.7291
quadrupole: -3.8502 -13.5819 17.4321 -1.2422 3.2956 0.7291
hfenergy: -1521.9700079 hartree
pointgroup: C01 [X(C14H11F1N2O5S1)]
dipole: 0.5438058 2.5397754 1.7554735 debye
polarizability: 252.1487495|-27.7130321|244.9539574|5.8025652|31.0507705|163.2593128 unknown
InChI: InChI=1S/C14H11FN2O5S/c15-23(21,22)13-3-1-2-11(9-13)16-14(18)8-10-4-6-12(7-5-10)17(19)20/h1-7,9,16H,8H2
charge 0 multiplicity 1
34 atoms
S  -3.937008 -1.964511 -1.383084
F  -3.58497 -1.633756 -3.176225
O  -0.298442 3.437668 1.435989
O  -2.888648 -3.095867 -0.929905
O  -5.526184 -2.165359 -1.277073
O  4.611555 -3.531137 0.084604
O  5.030383 -2.325479 -1.807574
N  -0.350885 1.218391 0.670294
N  4.529431 -2.457226 -0.625891
C  1.748826 2.117782 1.660435
C  2.471026 0.921919 1.068454
C  -1.695551 1.097935 0.232805
C  0.273588 2.330157 1.235706
C  -3.42361 -0.290546 -0.719648
C  -2.098273 -0.160029 -0.290125
C  2.59185 -0.292477 1.797583
C  3.03532 0.9963 -0.235294
C  -2.636488 2.165365 0.294455
C  -4.388381 0.727125 -0.675687
C  -3.959931 1.968353 -0.152358
C  3.810614 -1.292773 -0.043465
C  3.261212 -1.406352 1.251054
C  3.707779 -0.104414 -0.799481
H  1.74103 2.063052 2.765454
H  2.262165 3.060394 1.402154
H  0.239504 0.388893 0.551494
H  -1.408565 -1.010183 -0.349469
H  2.17364 -0.360103 2.808484
H  2.953346 1.92827 -0.805861
H  -2.31761 3.128962 0.695426
H  -5.412947 0.5606 -1.019417
H  -4.671039 2.798263 -0.094841
H  3.370531 -2.343873 1.802529
H  4.153032 -0.061743 -1.79692
