program: Gaussian 09
title: 000271885
version: EM64L-G09RevD.01
frameworkgroup: C1[X(C7H14O3)]
method: RPBEPBE
basis: SDD
operation: Freq
keyword: #pfreq=noraman
keyword: PBEPBE/SDD
title: #p freq=noraman PBEPBE/SDD
converged: YES YES NO NO
title: Mulliken charges:
elementType: O O O C C C C C C C H H H H H H H H H H H H H H
charge: -0.262433 -0.448808 -0.249407 -0.183706 -0.386975 -0.257182 0.260625 -0.687477 -0.687161 -0.315799 0.239943 0.232109 0.232233 0.220711 0.220840 0.218262 0.234959 0.222379 0.218475 0.222534 0.234560 0.188419 0.188366 0.344531
chargesum: 0.00000
title: Mulliken charges with hydrogens summed into heavy atoms:
elementType: O O O C C C C C C C
charge: -0.262433 -0.104277 -0.249407 0.056237 0.077367 0.184369 0.260625 -0.011876 -0.011591 0.060986
polarizability: 1.13786939e+02 9.38412330e-01 7.74226569e+01 -4.30078873e-02 -3.55693992e-01 7.05401016e+01
1716.lowfreq: -18.5011 -9.6535 -2.2104 -0.0012 -0.0010 -0.0007 5.2026 33.8159 60.8445
frequency: -17.4803 33.6303 60.8338 78.9000 111.0593 151.2919 196.0565 205.0278 237.5973 246.4635 268.5670 287.1678 288.8521 365.1157 436.2149 501.5195 642.7140 717.9962 787.7074 812.8194 874.2279 874.9423 926.6574 939.9498 962.8445 991.0114 1024.9929 1085.4551 1100.0722 1104.7866 1108.0777 1126.2313 1174.6400 1178.5948 1218.9912 1261.7508 1278.3664 1296.7412 1307.4927 1338.6762 1373.9399 1378.3318 1394.4140 1421.7278 1463.7736 1471.1623 1472.7870 1477.8337 1479.8439 1490.3732 1492.6707 1637.4827 2929.1614 2975.7400 2985.8900 2987.4294 2997.8982 3022.9706 3037.4985 3054.3246 3083.5215 3087.2620 3091.0298 3093.3450 3099.0633 3568.2780
redmass: 3.2518 4.9342 1.9933 4.4643 2.6865 2.7765 1.5403 1.3902 4.3645 1.3833 3.4593 1.1015 3.1947 2.7920 3.9301 3.8844 3.1492 6.7123 1.0767 4.5844 4.2424 1.1829 1.1672 3.8676 1.4607 6.1291 2.4635 2.7421 1.6122 2.5626 4.1166 1.5585 1.8675 1.1491 1.2624 1.1641 1.1179 1.2919 1.3184 1.6121 1.1904 1.4782 1.2323 1.4651 1.0445 1.0489 1.0785 1.0504 1.0774 1.0608 1.0851 9.1167 1.0544 1.1072 1.0343 1.0348 1.0576 1.0591 1.0856 1.1063 1.1008 1.1000 1.1012 1.1058 1.0997 1.0665
irintensity: 0.6083 4.9855 9.9480 3.7237 1.8059 0.0439 1.6725 0.9619 0.6085 0.4794 0.4843 170.1454 5.1623 0.4006 42.4095 1.9295 1.5258 4.2188 3.0654 18.4913 11.4268 0.1020 5.4237 37.2727 0.4320 52.5985 17.4088 43.8965 31.7139 1.8399 362.7190 3.8075 6.5252 0.3566 38.2764 0.0939 1.1548 9.1495 0.1547 55.4190 15.6220 6.6716 25.1908 5.4631 6.7705 2.0095 1.0747 20.8144 3.2910 18.4465 11.5455 155.1942 69.4087 59.6260 33.3707 22.9712 19.2714 19.9650 5.6050 8.4444 18.5153 46.0314 3.1901 51.6936 48.9498 3.1283
temp: 298.150 k
press: 1.00000 atm
elementType: 8 8 8 6 6 6 6 6 6 6 1 1 1 1 1 1 1 1 1 1 1 1 1 1
symmnumber: 1
zpe: 533365.7 jmol-1
zpe.correction: 0.203148 hartree
zpe.thermalcorrener: 0.215116 hartree
zpe.thermalcorrenthalpy: 0.216060 hartree
zpe.thermalcorrgfe: 0.164265 hartree
zpe.sumelectzpe: -499.979759 hartree
zpe.sumelectthermal: -499.967792 hartree
zpe.sumelectthermalent: -499.966847 hartree
zpe.sumelectthermalfe: -500.018643 hartree
dipole: 1.0621 0.2270 -0.0220
dipole: 1.0864
quadrupole: -49.0715 -68.1240 -60.1283
quadrupole: 14.1710 -0.8545 0.4802
quadrupole: 10.0364 -9.0161 -1.0203 14.1710 -0.8545 0.4802
hfenergy: -500.1829075 hartree
pointgroup: C01 [X(C7H14O3)]
dipole: -0.4156037 -0.0945946 0.0316218 debye
dipolederiv: -1.6665984 0.0842242 -0.1811564 0.1246971 -0.4034274 0.1210001 -0.2118867 0.1173242 -0.3633302 -0.7123745 0.2417177 -0.1931759 0.2777241 -0.4088675 -0.1120152 -0.2211188 -0.1151339 -0.5243142 -0.7232446 -0.0778366 0.025537 0.2193398 -0.6717041 0.2851092 -0.1986305 0.2585414 -0.5340181 -0.2074397 -0.099167 0.0537032 -0.0403901 0.0514033 0.0056688 0.0125042 0.0019708 0.060355 -0.1599748 -0.0209088 -0.0084447 -0.0589079 0.0576864 0.0334239 0.0192274 0.0359202 0.080751 0.7923937 0.037926 0.0062716 0.1332304 0.2963398 0.069492 -0.0640986 0.0621968 0.3228733 1.7706645 0.0187599 0.1190956 -0.3567948 0.7178448 -0.4787828 0.4012583 -0.4457129 0.49848 0.0277513 -0.0115065 -0.0268316 -0.0248749 0.0452518 -0.0367744 0.0678379 0.0151559 -0.0119992 0.0287421 0.0283975 0.0175049 -0.0717991 -0.0048355 -0.0044372 0.007178 -0.0482059 0.0372885 0.6592694 -0.1640269 0.1426483 -0.1001198 0.3848602 0.0411436 0.0949672 0.0357319 0.4349932 0.0343161 0.064884 -0.0485879 0.0592545 -0.0395692 0.0607623 -0.0446922 0.0611942 -0.0130418 0.0788467 0.0041606 0.0294607 0.002289 0.0814781 -0.000845 0.0183043 0.0062386 -0.1214667 0.0817245 -0.003508 -0.006229 0.006054 -0.1101747 -0.0488791 -0.0005037 -0.0566355 0.0663981 -0.0315036 0.0203215 0.0100195 -0.0476573 -0.1175851 -0.0418547 0.0275024 -0.0590178 0.0458565 -0.0316484 -0.012259 -0.0097949 -0.0455047 0.0562649 -0.015865 0.0485059 0.009913 -0.129427 -0.0993226 -0.1327013 0.0430316 -0.1213264 0.027072 0.0285311 0.0556115 0.0427481 0.0475155 0.0755389 0.0297373 -0.051589 0.0843977 -0.0230523 0.1118612 -0.0589483 0.0529193 0.0146472 0.0170481 0.108517 0.0806833 0.0753599 -0.0060076 -0.1047729 0.0503597 -0.0998439 -0.0061666 -0.1037115 -0.0901036 0.0978927 -0.0994764 0.013459 0.0423583 0.0849805 0.0281958 0.0657149 0.0401027 -0.0402324 -0.1110427 -0.0209458 0.0434569 -0.094695 -0.0711034 -0.0986973 -0.0780821 0.0709564 0.0562249 -0.0129485 0.0831758 -0.022224 0.0568235 -0.067623 0.1094478 0.0163687 -0.0135279 0.0383747 -0.0265166 0.0362523 -0.2401457 -0.032008 -0.0277892 -0.071694 0.0201578 -0.015827 0.0265943 -0.001996 0.0320025 0.0339845 0.0073351 -0.0031178 0.0465077 -0.2517853 0.0878185 -0.1075895 0.0524648 -0.1459801 0.2384916 0.1074204 0.0812748 0.1109354 0.3222313 unknown
polarizability: 113.558343|2.8639417|75.0447933|1.5303207|-3.2352278|73.1465608 unknown
InChI: InChI=1S/C7H14O3/c1-6(2)7(9)10-5-3-4-8/h6,8H,3-5H2,1-2H3
charge 0 multiplicity 1
24 atoms
O  0.064011 0.311881 -0.149229
O  -4.742303 0.31973 -0.592455
O  1.385052 -1.165838 1.074683
C  2.457908 0.655906 -0.215639
C  -2.353937 0.25756 -0.32251
C  -1.145456 -0.433036 0.311303
C  1.292963 -0.171426 0.316847
C  3.233663 1.27809 0.974899
C  3.382718 -0.249727 -1.070671
C  -3.665933 -0.429895 0.074363
H  2.040087 1.459875 -0.847032
H  -2.259831 0.243885 -1.423003
H  -2.392099 1.31508 -0.005811
H  -1.046219 -1.48924 -0.002645
H  -1.172104 -0.407398 1.416974
H  4.096876 1.855999 0.599324
H  3.606347 0.483283 1.64463
H  2.593958 1.958158 1.565335
H  4.23987 0.337416 -1.445895
H  2.847117 -0.671569 -1.939835
H  3.768584 -1.085547 -0.460935
H  -3.659474 -1.492228 -0.255525
H  -3.793736 -0.40863 1.179249
H  -5.616764 -0.086427 -0.366818
