program: Gaussian 09
title: 000271940
version: EM64L-G09RevD.01
frameworkgroup: C1[X(C22H22N2O3)]
method: RPBEPBE
basis: SDD
operation: Freq
keyword: #p
keyword: freq=noraman
keyword: PBEPBE/SDD
title: #p freq=noraman PBEPBE/SDD
converged: YES YES NO NO
title: Mulliken charges:
elementType: O O O N N C C C C C C C C C C C C C C C C C C C C C C H H H H H H H H H H H H H H H H H H H H H H
charge: -0.243884 -0.230028 -0.215742 -0.407402 0.048340 0.187539 0.397374 0.150860 -0.396096 -0.433959 -0.386335 -0.426076 -0.238958 0.224177 0.204346 0.502230 0.106774 -0.252103 -0.244908 -0.513249 -0.340427 -0.437582 -0.405311 -0.241813 -0.245718 -0.685582 -0.682511 0.273880 0.241613 0.269746 0.239770 0.234263 0.231573 0.232086 0.304440 0.247682 0.222176 0.208184 0.306990 0.214917 0.216037 0.209119 0.208586 0.231191 0.230831 0.208373 0.204675 0.235038 0.234873
chargesum: 0.00000
title: Mulliken charges with hydrogens summed into heavy atoms:
elementType: O O O N N C C C C C C C C C C C C C C C C C C C C C C
charge: -0.243884 -0.230028 -0.215742 -0.100412 0.048340 0.187539 0.397374 0.150860 -0.122216 -0.192346 -0.116589 -0.186306 -0.004695 0.224177 0.204346 0.502230 0.106774 -0.020529 -0.012822 -0.208810 -0.092745 -0.215406 -0.197127 0.189142 0.171987 -0.015186 -0.007925
polarizability: 5.20122217e+02 -2.01773868e+01 2.89436324e+02 1.46709572e+01 -2.21244254e+01 1.66688010e+02
1716.lowfreq: -6.6976 -2.6406 -0.0009 -0.0004 0.0009 2.1629 11.9922 19.0215 26.2863
frequency: 11.8965 19.0034 26.2509 41.8987 57.2342 62.3334 72.1914 94.6192 98.2214 110.5396 122.0757 138.8390 146.5002 170.6693 178.9882 208.5575 225.7278 229.2666 233.2466 242.8978 245.8834 304.1050 307.1241 312.9215 325.2179 335.5271 379.7073 401.0422 414.2527 437.9472 467.7748 470.9343 475.7934 507.9059 518.5227 524.7415 567.7000 584.1912 622.4601 624.4144 638.3115 650.0883 655.9105 713.7572 734.5774 744.9635 754.8584 757.6982 787.6058 789.3218 793.6696 794.1603 821.8821 827.1180 831.4192 866.9014 887.7622 889.4520 899.5106 901.4656 910.4431 935.3455 944.0417 971.9562 984.8743 992.6490 998.4072 1010.3398 1025.2944 1031.4125 1032.6888 1042.6584 1079.9330 1113.9396 1116.4880 1131.4585 1133.5097 1134.3747 1137.9474 1154.8373 1177.1065 1180.3677 1193.7720 1222.2109 1235.4317 1240.9327 1259.6890 1262.1847 1262.5960 1275.8857 1283.2348 1337.2590 1365.8516 1367.1453 1368.2341 1394.7969 1399.2220 1400.4508 1406.3154 1411.0191 1432.5451 1438.8496 1451.2562 1460.1123 1460.5791 1473.9256 1475.5991 1485.3824 1486.9943 1497.8904 1509.3117 1514.0835 1561.5569 1582.7350 1589.5142 1593.2953 1605.8321 1615.9782 1629.0530 2953.7518 2960.9365 2961.2630 2996.8393 2998.3227 3013.0714 3020.7596 3094.6358 3095.5284 3105.8376 3108.8111 3123.1690 3126.7677 3127.0747 3134.4232 3147.4143 3151.5069 3165.2617 3166.2005 3168.2300 3173.5642 3371.2037
redmass: 4.9409 4.7138 5.1490 5.1634 5.3183 3.4460 4.2086 3.3153 3.1281 2.0060 2.0586 4.9814 5.0719 5.6738 4.4002 5.0013 4.2500 3.0289 3.5407 1.2764 1.2920 5.2445 4.4108 5.2217 6.1487 4.3200 4.1070 4.4158 4.5360 4.2985 3.1964 3.6590 4.7360 5.6372 4.7266 6.9473 4.2760 5.5026 2.6236 4.3241 2.2535 2.3165 5.0314 3.8750 4.6765 3.1470 3.3718 1.6665 4.7845 2.1014 2.1206 2.3235 1.1074 1.6808 1.1136 3.9099 3.3433 1.8753 1.4320 3.4807 1.3718 1.4194 1.5888 1.3976 3.9035 1.4216 1.3348 3.7857 3.2402 2.6933 2.5914 3.1789 2.4830 2.2686 2.2039 2.2163 1.4344 1.4476 2.1504 1.4086 1.2072 1.6490 1.4967 1.9690 1.8854 1.9956 3.1168 1.1426 1.1397 1.3348 1.9054 1.7803 1.2996 1.4510 2.4826 1.5464 1.3296 2.5266 2.3603 6.2503 5.1590 2.4468 2.3973 1.0397 1.0402 1.1760 1.0624 1.1624 1.0818 1.6172 2.4320 3.7559 7.1073 7.2238 6.1809 5.5108 6.3184 6.8813 6.6235 1.0553 1.0777 1.0641 1.0361 1.0363 1.1075 1.1076 1.0990 1.0988 1.1014 1.1014 1.0866 1.0873 1.0892 1.0886 1.0917 1.0943 1.0998 1.0989 1.0931 1.0914 1.0758
irintensity: 0.3754 0.1392 0.8853 0.6530 1.9778 6.4144 6.3656 0.6258 1.1018 4.1529 0.3112 2.0452 0.2762 3.0217 1.8777 2.1215 2.7681 6.3451 2.8392 0.0605 0.0422 8.9649 3.8274 0.6209 0.3271 14.2197 14.8156 0.3649 0.9510 4.7460 1.3125 2.9403 13.1071 8.8093 4.3754 1.0856 7.6504 4.2499 4.1681 6.4191 52.0514 29.5762 40.7755 6.9872 17.0422 0.3344 2.6542 2.2334 3.7070 59.8686 52.3826 19.4834 8.6688 45.4384 0.1209 13.6461 9.6367 3.3721 3.4397 79.8511 13.3986 1.2865 35.3013 3.3165 15.8421 5.6234 1.0671 26.4072 13.2068 107.7583 43.9468 12.6367 68.4210 2.5586 2.2268 142.4732 3.9991 5.6972 211.6117 54.5250 17.4053 64.6655 149.4822 67.9823 4.1309 176.2642 518.0077 0.1436 0.1952 4.0170 31.3185 52.9933 11.7468 11.7976 4.5761 55.5249 12.9678 1.7416 7.7560 1.0062 66.2583 1.3430 0.3778 4.2437 19.4404 118.3942 37.4209 124.4821 3.6433 319.7469 19.5430 13.6931 61.2345 7.1149 23.0142 13.2116 167.0452 153.8547 7.4053 50.2519 64.6741 24.8839 24.4447 34.0989 34.5596 29.3071 30.8668 22.9929 32.8947 33.4941 1.4367 3.4319 13.3682 6.4630 14.5075 33.2644 38.0064 8.6397 20.9869 7.3776 13.0396
temp: 298.150 k
press: 1.00000 atm
elementType: 8 8 8 7 7 6 6 6 6 6 6 6 6 6 6 6 6 6 6 6 6 6 6 6 6 6 6 1 1 1 1 1 1 1 1 1 1 1 1 1 1 1 1 1 1 1 1 1 1
symmnumber: 1
zpe: 1022896.4 jmol-1
zpe.correction: 0.389601 hartree
zpe.thermalcorrener: 0.414800 hartree
zpe.thermalcorrenthalpy: 0.415745 hartree
zpe.thermalcorrgfe: 0.331585 hartree
zpe.sumelectzpe: -1184.754203 hartree
zpe.sumelectthermal: -1184.729004 hartree
zpe.sumelectthermalent: -1184.728059 hartree
zpe.sumelectthermalfe: -1184.812219 hartree
dipole: -0.2906 -5.0502 -1.2657
dipole: 5.2145
quadrupole: -120.4876 -146.0722 -157.4283
quadrupole: 0.0872 3.3000 -1.7709
quadrupole: 20.8418 -4.7429 -16.0989 0.0872 3.3000 -1.7709
hfenergy: -1185.1438039 hartree
pointgroup: C01 [X(C22H22N2O3)]
dipole: -0.12119 1.2693916 -1.6070981 debye
polarizability: 517.37903|-18.706458|171.4949806|-33.0999569|-29.5251052|287.3725398 unknown
InChI: InChI=1S/C22H22N2O3/c1-3-26-20-13-12-16(14-21(20)27-4-2)15-23-24-22(25)19-11-7-9-17-8-5-6-10-18(17)19/h5-15,24H,3-4H2,1-2H3
charge 0 multiplicity 1
49 atoms
O  4.925925 -1.380915 0.892225
O  6.2770 0.011221 -0.907854
O  -1.851339 -1.135512 2.17259
N  -1.455879 0.195355 0.275307
N  -0.086348 -0.013643 0.277272
C  -4.454035 -0.12755 -0.21337
C  -5.846591 0.287844 -0.242403
C  -3.754036 -0.0986 1.053854
C  -3.865022 -0.597637 -1.439391
C  -6.497711 0.672826 0.974874
C  -4.444653 0.240745 2.22742
C  -6.559784 0.280031 -1.487343
C  -5.815582 0.629403 2.192105
C  4.16234 -0.533369 0.088239
C  4.89924 0.223961 -0.890055
C  2.074737 0.511482 -0.68931
C  -2.287755 -0.42973 1.223656
C  -4.591536 -0.605306 -2.632963
C  -5.945621 -0.146553 -2.665259
C  2.769167 -0.383231 0.178225
C  4.207376 1.110115 -1.746208
C  2.806074 1.253456 -1.647172
C  0.623233 0.669749 -0.600876
C  4.207296 -2.169973 1.917455
C  7.076795 0.772243 -1.890645
C  5.259367 -2.998871 2.647904
C  8.529604 0.351045 -1.689681
H  -2.846082 -0.997438 -1.430005
H  -7.547582 0.986898 0.935677
H  -3.902388 0.209817 3.177993
H  -7.60714 0.605053 -1.493346
H  -6.322834 0.903953 3.122801
H  -4.125631 -0.980095 -3.550992
H  -6.50022 -0.152319 -3.609693
H  2.176551 -0.939807 0.90888
H  4.753891 1.692595 -2.492972
H  2.284044 1.94574 -2.318497
H  0.158692 1.390682 -1.306071
H  -1.886695 0.852754 -0.39408
H  3.452953 -2.815023 1.422708
H  3.680875 -1.48022 2.608186
H  6.941056 1.85891 -1.711815
H  6.724271 0.534103 -2.91554
H  6.011079 -2.344103 3.120613
H  5.77925 -3.673708 1.946814
H  4.778948 -3.609142 3.434148
H  9.182697 0.889096 -2.400813
H  8.861802 0.580807 -0.663222
H  8.645605 -0.733239 -1.855968
