program: Gaussian 09
title: 000271881
version: EM64L-G09RevD.01
frameworkgroup: C1[X(C6H5N3O4)]
method: RPBEPBE
basis: SDD
operation: Freq
keyword: #pfreq=noraman
keyword: PBEPBE/SDD
title: #p freq=noraman PBEPBE/SDD
converged: YES YES NO YES
title: Mulliken charges:
elementType: O O O O N N N C C C C C C H H H H H
charge: -0.437822 -0.193746 -0.256432 -0.242221 -0.042821 0.033444 -0.596598 0.249400 0.276007 -0.350101 0.109679 -0.406058 0.126695 0.328344 0.292066 0.377038 0.341949 0.391178
chargesum: 0.00000
title: Mulliken charges with hydrogens summed into heavy atoms:
elementType: O O O O N N N C C C C C C
charge: -0.046643 -0.193746 -0.256432 -0.242221 -0.042821 0.033444 0.122389 0.249400 0.276007 -0.021758 0.109679 -0.113992 0.126695
polarizability: 1.68202173e+02 -5.27085144e+00 1.25641739e+02 -6.24477660e-04 -4.23695507e-03 3.91113570e+01
1716.lowfreq: -10.0745 -6.8877 -0.0011 -0.0010 -0.0002 0.9035 58.1170 70.0620 112.7038
frequency: 58.1135 70.0606 112.7037 140.3696 150.8165 270.3939 292.2548 330.1494 353.2608 389.5295 426.7471 472.9971 511.8512 544.8485 573.7071 594.2170 628.4869 657.5950 677.2539 716.2345 724.8205 737.8510 776.9956 783.8686 909.0281 967.0657 987.8182 992.2555 1041.6351 1063.3307 1160.3476 1179.4779 1253.9055 1324.7262 1335.4395 1353.2442 1378.5983 1399.1254 1483.0976 1525.4618 1577.8694 1615.5617 1646.1069 3167.2141 3177.0292 3431.8128 3533.8688 3631.2947
redmass: 12.2019 9.5317 6.1393 9.5147 6.1181 7.5560 6.8345 9.4311 4.9231 6.1023 4.1411 9.3474 2.6224 4.6919 5.2295 1.2983 1.2764 7.8956 5.6516 9.2345 1.8145 2.1211 5.6437 6.0888 7.3743 1.5240 1.3689 2.5204 3.1097 2.1824 2.0367 8.6358 1.6297 2.5603 2.9723 4.0174 5.2996 4.1578 3.3922 2.2168 3.0984 5.7667 8.9382 1.0929 1.0931 1.0498 1.0643 1.1006
irintensity: 0.0192 0.5808 1.4649 0.0221 1.6610 7.0116 0.1474 8.2159 3.9928 3.1434 0.0104 3.7874 71.1494 34.3474 37.2093 43.1931 207.6935 22.0047 0.3743 3.9846 115.2254 5.2202 70.7856 2.8573 12.0207 14.1821 7.9977 3.4149 341.1229 21.4932 205.4305 221.8847 87.0278 54.9127 128.5595 50.6177 15.9308 21.4133 28.3008 51.8950 107.8993 668.8321 226.4163 0.9820 10.2981 120.6522 63.2473 101.8543
temp: 298.150 k
press: 1.00000 atm
elementType: 8 8 8 8 7 7 7 6 6 6 6 6 6 1 1 1 1 1
symmnumber: 1
zpe: 311809.3 jmol-1
zpe.correction: 0.118762 hartree
zpe.thermalcorrener: 0.129664 hartree
zpe.thermalcorrenthalpy: 0.130608 hartree
zpe.thermalcorrgfe: 0.081341 hartree
zpe.sumelectzpe: -695.793924 hartree
zpe.sumelectthermal: -695.783022 hartree
zpe.sumelectthermalent: -695.782078 hartree
zpe.sumelectthermalfe: -695.831344 hartree
dipole: 1.1826 4.1791 0.0022
dipole: 4.3432
quadrupole: -67.5473 -81.8426 -73.6868
quadrupole: -7.5677 -0.0118 0.0055
quadrupole: 6.8116 -7.4837 0.6721 -7.5677 -0.0118 0.0055
hfenergy: -695.9126856 hartree
pointgroup: C01 [X(C6H5N3O4)]
dipole: -0.4765992 1.6409092 0.0092912 debye
dipolederiv: -1.1948608 0.4366083 -0.0072728 0.5801373 -0.5734185 0.0075848 -0.0058267 0.0054585 -0.4293784 -0.4045113 0.0137975 -0.0029275 0.2091363 -0.9780503 -0.0050059 -0.0008264 -0.0081361 -0.2160873 -0.9558107 0.0073712 -0.0110977 -0.1265973 -0.4170606 -0.0038071 -0.0125235 -0.0015097 -0.2678623 -0.8408406 -0.2448541 -0.0108264 -0.3547676 -0.9631831 -0.0125622 -0.0121464 -0.0111206 -0.3293262 -0.9410612 -0.5212244 -0.0159997 0.1163482 -0.2504646 0.0021465 -0.0089779 -0.0077248 -0.282352 1.4859628 -0.4318558 0.0163455 -0.4725142 1.3956774 0.0055852 0.0158896 0.0062381 0.1982088 -1.1265472 -0.6587509 -0.015389 -0.4787708 -0.5822071 -0.007154 -0.0134572 -0.0100519 -0.6081981 -0.899601 0.493107 -0.0093109 -0.1998943 -0.5779515 -0.0095209 -0.0168532 0.0014407 0.0151312 -1.0849709 -0.0054223 -0.0172024 0.0619304 -0.6768159 -0.0062577 -0.0163514 -0.0074442 -0.0106334 0.876898 -0.3079805 0.0109108 -0.0374566 0.0195688 -0.0001714 0.0139329 -0.0045487 -0.0165619 1.2512265 0.7182496 0.023627 0.4165995 0.5895432 0.0103595 0.0201765 0.01504 0.2330031 0.461152 0.3493199 0.0107303 0.0619973 0.7402271 0.0087921 0.0077024 0.0134219 0.0219207 2.2711189 0.0935436 0.033177 0.2018131 1.308837 0.0149605 0.0344562 0.0133219 0.2465859 0.1661189 0.0132991 0.0002385 -0.0060766 0.108796 -0.000661 0.0000076 -0.0003216 0.1605728 0.0453778 0.051568 -0.00073 0.063087 0.0935372 0.0006309 -0.0006498 0.0004242 0.1274449 0.3351117 0.0182976 -0.000485 0.0381828 0.2721456 -0.0005589 -0.0002423 -0.0009598 0.3786646 0.2378097 0.0632088 -0.0013548 0.0930494 0.2845958 0.000522 -0.000974 0.0001198 0.3717457 0.3174278 -0.0882827 -0.0024332 -0.1662037 0.2062235 -0.0048825 -0.0033362 -0.0036476 0.4071217 unknown
polarizability: 168.0941235|5.542315|125.7047849|2.1183383|1.0301561|39.1563604 unknown
InChI: InChI=1S/C6H5N3O4/c7-5-4(9(12)13)1-3(2-8-5)6(10)11/h1-2,10H,7H2
charge 0 multiplicity 1
18 atoms
O  -3.735653 0.474716 -0.028362
O  1.972003 -2.386475 0.031361
O  3.387599 -0.600762 0.074165
O  -2.994378 -1.732016 -0.041177
N  0.079133 2.057446 0.049546
N  2.184843 -1.115869 0.04879
N  2.39556 1.868136 0.083696
C  1.039603 -0.204638 0.040029
C  -1.375263 0.087306 0.004842
C  -0.25202 -0.763143 0.013307
C  1.193448 1.234196 0.058194
C  -1.14556 1.497505 0.023996
C  -2.731309 -0.506098 -0.02303
H  -0.375868 -1.850088 -0.000513
H  -1.995424 2.186513 0.018133
H  3.250851 1.302098 0.09056
H  2.390626 2.888115 0.094596
H  -4.624089 0.028258 -0.047634
