program: Gaussian 09
title: 000272017
version: EM64L-G09RevD.01
frameworkgroup: C1[X(C26H29N3O2)]
method: RPBEPBE
basis: SDD
operation: Freq
keyword: #p
keyword: freq=noraman
keyword: PBEPBE/SDD
title: #p freq=noraman PBEPBE/SDD
converged: NO YES NO NO
title: Mulliken charges:
elementType: O O N N N C C C C C C C C C C C C C C C C C C C C C C C C C C H H H H H H H H H H H H H H H H H H H H H H H H H H H H H
charge: -0.205507 -0.185142 -0.079261 -0.318690 -0.466615 0.406158 -0.468079 -0.480301 -0.566994 -0.591444 -0.402893 -0.404495 0.105227 0.107174 -0.479206 0.220035 0.450801 0.292416 0.229902 0.208601 -0.513520 -0.377964 -0.448980 -0.387489 -0.363039 -0.677953 -0.267710 -0.229345 -0.221034 -0.220452 -0.245414 0.203555 0.214541 0.217506 0.195642 0.241296 0.256004 0.259198 0.241186 0.239748 0.196030 0.187309 0.214890 0.220473 0.194654 0.303153 0.218994 0.226060 0.261962 0.232777 0.226229 0.227014 0.275063 0.218059 0.194149 0.218422 0.224746 0.225217 0.219598 0.227736
chargesum: 0.00000
title: Mulliken charges with hydrogens summed into heavy atoms:
elementType: O O N N N C C C C C C C C C C C C C C C C C C C C C C C C C C
charge: -0.205507 -0.185142 -0.079261 -0.318690 -0.163462 0.406158 -0.049983 -0.067153 -0.069694 -0.091060 0.032885 -0.002296 0.105227 0.107174 -0.064079 0.220035 0.450801 0.292416 0.229902 0.208601 -0.068466 -0.116002 -0.216203 -0.161260 -0.136026 0.009318 -0.049288 -0.004599 0.004183 -0.000854 -0.017679
polarizability: 3.65859664e+02 -3.39489852e+01 2.98753159e+02 -1.22879947e+01 1.19172438e+01 2.38141757e+02
1716.lowfreq: -7.1120 -6.1776 -0.0007 -0.0006 0.0005 2.4283 14.1646 16.0816 31.0985
frequency: 13.7077 16.0625 31.0433 40.0286 40.5868 52.9995 64.6345 76.7226 81.6194 88.9988 104.1162 108.0416 159.6259 174.0195 194.4214 197.3991 199.3895 221.3988 231.5031 245.1449 275.5970 302.5237 310.8938 312.3123 331.5292 334.9265 361.9089 368.3003 379.3884 405.7704 412.3967 437.6227 444.0152 458.6529 470.3480 493.8914 495.4560 512.3368 519.2757 534.7429 563.1494 568.6684 584.8320 597.5689 611.9730 615.1775 618.0461 639.5857 661.8026 662.7140 701.1191 705.5062 737.2747 748.0996 761.4508 764.8229 782.8472 787.8394 808.6286 813.0933 841.2469 847.2490 860.2467 870.8532 896.0194 909.0646 916.1426 923.3712 927.4876 944.4705 968.5115 976.0800 982.9980 983.9641 990.0687 996.6434 997.8876 1006.0693 1014.5943 1018.6433 1026.3123 1029.7536 1046.5552 1053.9194 1069.4259 1077.5327 1087.4560 1110.3547 1116.6364 1128.3730 1130.4243 1149.7315 1155.8243 1170.1762 1170.8562 1179.5935 1181.4903 1192.1451 1207.7209 1214.1354 1222.6107 1227.2120 1236.5515 1250.0871 1258.7550 1271.9750 1278.5804 1288.9751 1296.6802 1311.8331 1314.8864 1319.0098 1324.4280 1328.8743 1333.2836 1340.2598 1353.1546 1355.2238 1365.0114 1381.0778 1389.7645 1397.0511 1410.9630 1434.1122 1435.4170 1440.6436 1445.1248 1450.3150 1460.7848 1462.7496 1465.2519 1468.7936 1474.5005 1477.5103 1482.9651 1484.8794 1488.2970 1492.9397 1584.0937 1592.7901 1594.5123 1604.7491 1614.6940 1635.7780 1637.4521 2828.8862 2839.2020 2853.9965 2968.5176 2971.1284 2974.4318 2975.3886 2981.3581 2984.1851 2986.0146 3020.2085 3035.0960 3039.4525 3043.8139 3046.4629 3059.0733 3077.1556 3079.6590 3104.0068 3112.7950 3122.8136 3124.1200 3132.5726 3136.0536 3146.4593 3147.1027 3161.8550 3163.2829 3604.6512
redmass: 4.9213 5.5585 3.8849 5.9440 5.1938 5.3100 3.5586 3.9063 3.1296 3.9356 5.1713 5.2959 2.7717 3.2229 4.0571 3.7657 2.2142 2.5846 2.7815 2.4031 2.6794 2.9488 2.6023 3.1968 2.5647 4.0120 3.3807 2.5111 2.2375 2.8495 4.1258 3.2172 4.0098 3.3637 3.7799 4.1108 3.9102 1.3040 3.6424 3.4731 3.7310 4.4132 3.7366 4.4950 4.7455 4.0080 4.7912 3.7436 3.8593 4.0998 4.0591 2.2192 1.7424 1.4770 3.2747 2.7665 1.2630 2.5610 3.7041 1.7122 4.2509 1.5173 1.2487 4.5426 1.9765 3.4314 1.4866 2.6067 1.3858 2.1217 1.3018 2.2519 1.6673 1.7688 5.9189 2.1538 1.5720 2.3882 2.0117 1.9667 2.1173 2.1554 2.5777 1.8204 1.9630 1.6097 2.0005 1.7706 2.3476 2.9720 1.8832 2.1039 1.8481 1.0603 1.3436 1.1255 1.1090 2.0187 1.4158 1.9061 2.1907 1.5519 1.6877 1.7492 1.7322 1.5659 1.4069 1.4840 2.4891 1.4984 1.4771 1.6812 2.0591 1.4273 1.5522 1.5163 2.4947 1.5902 1.4938 3.2918 1.2462 1.8274 4.6237 1.2710 2.0223 2.0677 1.0943 1.0879 1.0945 1.1276 1.8950 1.6809 1.0843 1.1157 1.9915 2.8144 1.1150 1.0804 7.5136 9.6815 6.1593 7.6731 6.1286 8.2580 9.1435 1.0718 1.0719 1.0698 1.0660 1.0665 1.0603 1.0645 1.0607 1.0372 1.0865 1.0865 1.1020 1.0988 1.0904 1.0948 1.0943 1.0991 1.0914 1.1010 1.0871 1.0861 1.0849 1.0889 1.0914 1.0952 1.0954 1.1014 1.1002 1.0803
irintensity: 0.2302 0.2460 0.0339 0.0526 0.3889 1.5520 0.7852 2.6022 0.6495 0.9139 1.7578 5.8720 1.6429 0.9669 2.1439 4.8863 0.7907 1.4701 1.0362 3.6446 1.1497 1.2802 2.7528 0.4590 3.2652 0.5150 0.9990 3.2739 0.6629 0.2981 0.9039 11.6052 2.5163 11.1733 0.7954 1.9326 1.7767 62.0774 32.3631 31.5226 2.7585 3.2611 0.0732 1.4945 10.7066 11.0226 4.5127 2.8375 2.4347 8.3411 3.0955 33.5254 47.9492 80.7715 21.8233 23.6677 9.6130 4.9186 4.6887 2.0136 0.6723 0.2844 0.3523 3.7385 0.2944 5.9074 3.6893 22.9141 1.4370 1.6407 0.2504 11.0490 5.3382 8.3030 0.4252 4.3641 0.3731 7.8373 11.7159 11.2261 10.8509 1.0282 0.4226 6.0013 5.7825 15.9735 15.4782 2.3765 27.1019 4.6285 117.7088 5.9937 4.7894 0.4708 0.4290 14.2108 2.4329 28.6057 3.6207 8.8878 103.7157 17.2301 5.9699 2.8572 11.5735 40.4456 21.3152 6.3323 103.0596 13.0168 12.7670 32.0124 30.2557 0.1038 23.6505 5.5742 98.3660 30.5887 3.8163 4.0980 17.9789 2.4695 20.2944 3.4025 3.0744 11.1337 4.2900 20.8581 7.7907 11.0810 17.7227 7.7945 8.7046 1.9628 10.0567 2.1145 12.9716 14.5235 9.0416 280.5036 1.2995 60.2302 6.8391 21.6232 30.0237 50.5924 51.7286 152.1197 3.4331 8.0278 49.9097 33.2356 32.4366 46.3022 17.9236 57.7900 20.3447 37.7361 29.4235 12.0602 18.4769 60.7740 9.8566 17.4343 8.5445 0.1253 1.4051 6.3582 18.1171 38.8694 32.6596 27.6270 31.3971 49.5938
temp: 298.150 k
press: 1.00000 atm
elementType: 8 8 7 7 7 6 6 6 6 6 6 6 6 6 6 6 6 6 6 6 6 6 6 6 6 6 6 6 6 6 6 1 1 1 1 1 1 1 1 1 1 1 1 1 1 1 1 1 1 1 1 1 1 1 1 1 1 1 1 1
symmnumber: 1
zpe: 1302804.6 jmol-1
zpe.correction: 0.496212 hartree
zpe.thermalcorrener: 0.523696 hartree
zpe.thermalcorrenthalpy: 0.524640 hartree
zpe.thermalcorrgfe: 0.436001 hartree
zpe.sumelectzpe: -1320.657367 hartree
zpe.sumelectthermal: -1320.629883 hartree
zpe.sumelectthermalent: -1320.628939 hartree
zpe.sumelectthermalfe: -1320.717578 hartree
dipole: -2.3906 0.5505 0.3913
dipole: 2.4842
quadrupole: -179.8943 -159.6713 -194.1952
quadrupole: 10.7770 -1.9307 -8.2658
quadrupole: -1.9740 18.2490 -16.2749 10.7770 -1.9307 -8.2658
hfenergy: -1321.1535786 hartree
pointgroup: C01 [X(C26H29N3O2)]
dipole: -0.9510121 -0.1405754 -0.1761064 debye
polarizability: 368.6132802|27.9746086|285.7249101|17.9590785|25.2383312|248.4163896 unknown
InChI: InChI=1S/C26H29N3O2/c1-2-21-25(20-10-6-7-11-22(20)27-21)29-23(30)16-26(17-24(29)31)12-14-28(15-13-26)18-19-8-4-3-5-9-19/h3-11,27H,2,12-18H2,1H3
charge 0 multiplicity 1
60 atoms
O  1.938262 0.15146 -2.556269
O  1.614191 0.480138 2.101066
N  -3.678424 1.307967 0.312349
N  1.834663 0.345119 -0.223849
N  4.42286 -2.235351 -0.135278
C  -0.810944 1.561744 -0.483583
C  -1.570749 0.203416 -0.427575
C  -1.860767 2.690691 -0.674891
C  0.179263 1.586484 -1.672619
C  0.035795 1.800802 0.792763
C  -2.725761 0.205398 0.592737
C  -3.008672 2.629248 0.352732
C  1.369623 0.641235 -1.546527
C  1.198119 0.829265 0.968161
C  -4.879994 1.256416 1.179158
C  3.012397 -0.472575 -0.074075
C  -5.788745 0.067778 0.877284
C  3.101919 -1.832695 -0.379342
C  4.30895 -0.010582 0.372698
C  5.18304 -1.150892 0.324384
C  2.07307 -2.788072 -0.916993
C  -6.029984 -0.331686 -0.461893
C  -6.442555 -0.624274 1.925807
C  4.822068 1.236372 0.809601
C  6.541357 -1.075768 0.697435
C  2.360313 -3.23198 -2.37784
C  6.178337 1.319345 1.17931
C  -6.911041 -1.398064 -0.745364
C  -7.329037 -1.690031 1.645199
C  7.029615 0.176623 1.124526
C  -7.56697 -2.079949 0.30747
H  -0.87605 -0.625122 -0.186184
H  -1.994119 -0.001972 -1.429954
H  -2.299465 2.595243 -1.687724
H  -1.367327 3.681838 -0.616766
H  0.589452 2.612144 -1.789563
H  -0.321565 1.337431 -2.624793
H  -0.55886 1.737284 1.718234
H  0.460341 2.826585 0.760496
H  -3.273277 -0.751502 0.528364
H  -2.321749 0.276524 1.636341
H  -2.6176 2.863333 1.378031
H  -3.756895 3.407882 0.111702
H  -5.443458 2.195648 1.004422
H  -4.611401 1.246156 2.266825
H  4.773219 -3.179108 -0.284346
H  2.004095 -3.678944 -0.259886
H  1.08611 -2.293351 -0.877135
H  -5.506878 0.197548 -1.266354
H  -6.255993 -0.330812 2.966821
H  4.173792 2.117356 0.868131
H  7.197907 -1.952322 0.658289
H  2.415458 -2.346657 -3.032885
H  1.55936 -3.898901 -2.74488
H  3.317439 -3.780776 -2.45582
H  6.590709 2.275425 1.520452
H  -7.088259 -1.698008 -1.784761
H  -7.826801 -2.217025 2.467238
H  8.079772 0.273171 1.42176
H  -8.251254 -2.907251 0.087661
