program: Gaussian 09
title: 000271891
version: EM64L-G09RevD.01
frameworkgroup: C1[X(C11H9N7O2)]
method: RPBEPBE
basis: SDD
operation: Freq
keyword: #p
keyword: freq=noraman
keyword: PBEPBE/SDD
title: #p freq=noraman PBEPBE/SDD
converged: NO NO NO NO
title: Mulliken charges:
elementType: O O N N N N N N N C C C C C C C C C C C H H H H H H H H H
charge: -0.442842 -0.248575 -0.230869 -0.065499 -0.054909 -0.028261 -0.115181 -0.616698 -0.584701 0.429442 -0.114810 -0.039766 -0.355736 -0.355018 0.214786 0.267975 -0.333444 -0.303994 0.006424 0.110900 0.297769 0.278602 0.275082 0.276226 0.335280 0.344930 0.335718 0.331558 0.385611
chargesum: 0.00000
title: Mulliken charges with hydrogens summed into heavy atoms:
elementType: O O N N N N N N N C C C C C C C C C C C
charge: -0.057231 -0.248575 -0.230869 -0.065499 -0.054909 -0.028261 -0.115181 0.063512 0.082575 0.429442 -0.114810 -0.039766 -0.057967 -0.076416 0.214786 0.267975 -0.058363 -0.027768 0.006424 0.110900
polarizability: 4.08514993e+02 -3.67705729e-01 1.83694529e+02 9.61626407e-03 -1.09738072e-04 6.74553826e+01
1716.lowfreq: -2.2146 0.0003 0.0005 0.0014 1.5948 8.4975 36.9381 41.9057 72.9741
frequency: 36.9318 41.3357 72.9731 81.3645 100.3218 146.5120 178.9461 203.3334 208.2839 224.2720 268.2244 303.2271 314.8935 377.5913 413.1358 417.7281 431.9482 470.4811 492.7263 496.6407 500.4475 516.6585 543.5338 552.2093 557.3550 591.8586 605.5130 623.1832 631.1047 635.4714 661.7317 670.9526 687.4401 718.3779 761.7733 761.9739 796.9778 813.2589 858.7782 880.6566 898.6481 914.7060 997.2280 997.3522 1006.4610 1016.9186 1035.8096 1066.7803 1086.6331 1127.3748 1130.3362 1150.1422 1175.6235 1185.7349 1300.8935 1304.9056 1316.8496 1323.7447 1347.5763 1374.8260 1395.3412 1423.7172 1450.4232 1493.6861 1500.8856 1560.5568 1577.3326 1584.5539 1602.1385 1616.7993 1632.5216 1638.3690 3162.1122 3171.9937 3190.7853 3193.9366 3530.9614 3536.2005 3557.8466 3691.6572 3718.5289
redmass: 7.3525 5.7799 6.9683 5.9574 7.1571 7.8280 6.5194 5.6020 7.4266 8.2237 4.5058 7.0084 3.1960 7.2198 2.9352 6.1096 5.7494 1.1822 5.7659 1.2552 2.3980 7.6511 1.1806 1.1070 8.2404 1.2482 4.9916 6.0483 8.1683 5.4907 8.5906 6.2205 3.6901 11.4550 6.3670 4.3565 12.1081 10.6623 1.2654 1.6258 9.4835 2.7200 4.7717 1.3531 1.3568 3.3491 2.8776 4.0935 4.3781 1.5316 2.1258 1.6708 4.8700 1.2071 1.7042 4.4692 2.4534 5.4616 6.4708 5.4129 7.8223 3.7828 6.0982 3.0680 3.0298 2.7407 7.3696 8.3025 1.4495 5.0481 2.2347 7.7880 1.0907 1.0891 1.0959 1.0965 1.0642 1.0447 1.0441 1.1054 1.1060
irintensity: 0.5368 0.0223 0.1740 0.4778 3.1451 0.2315 2.3309 10.5910 0.0200 0.5700 0.6623 0.7463 9.9833 3.0796 0.4561 28.6383 16.4206 199.2281 6.3264 136.4527 180.0490 9.4379 87.5732 5.5006 1.2334 100.4656 24.4342 1.3825 14.5809 0.8590 8.2364 1.4713 83.0980 15.4907 10.4967 16.3227 12.2127 1.4440 4.0009 62.1483 95.3502 6.1801 198.9562 0.0204 0.0045 189.3878 7.5584 10.3593 11.8815 12.6480 3.3772 200.0052 8.0323 8.6300 3.0134 140.5024 44.6545 207.8543 6.6291 122.0247 11.9445 24.4615 73.1766 204.7093 164.5423 284.7503 360.1475 337.7578 583.7222 192.3539 443.1122 211.3481 0.7911 0.3737 0.0884 0.3844 64.0929 120.4821 211.2773 42.4889 50.7725
temp: 298.150 k
press: 1.00000 atm
elementType: 8 8 7 7 7 7 7 7 7 6 6 6 6 6 6 6 6 6 6 6 1 1 1 1 1 1 1 1 1
symmnumber: 1
zpe: 542141.7 jmol-1
zpe.correction: 0.206491 hartree
zpe.thermalcorrener: 0.222627 hartree
zpe.thermalcorrenthalpy: 0.223571 hartree
zpe.thermalcorrgfe: 0.162276 hartree
zpe.sumelectzpe: -956.897622 hartree
zpe.sumelectthermal: -956.881486 hartree
zpe.sumelectthermalent: -956.880542 hartree
zpe.sumelectthermalfe: -956.941837 hartree
dipole: -3.2548 4.6368 0.0004
dipole: 5.6652
quadrupole: -91.0442 -103.9006 -118.2440
quadrupole: 5.5178 -0.0014 -0.0015
quadrupole: 13.3521 0.4956 -13.8477 5.5178 -0.0014 -0.0015
hfenergy: -957.104113 hartree
pointgroup: C01 [X(C11H9N7O2)]
dipole: 1.2830304 1.822527 -0.0001631 debye
polarizability: 408.5155775|0.0622254|183.6939447|0.0096164|0.0000967|67.4553826 unknown
InChI: InChI=1S/C11H9N7O2/c12-8-7-9(15-11(13)14-8)17-18(16-7)6-3-1-5(2-4-6)10(19)20/h1-4,19H,12-13H2
charge 0 multiplicity 1
29 atoms
O  -6.018479 1.1749 -0.000224
O  -6.130737 -1.147727 0.00002
N  0.289951 -0.049408 0.000044
N  1.022598 1.122591 0.000148
N  1.010378 -1.242705 0.000025
N  3.452129 -1.557408 0.000109
N  4.709621 0.587353 0.00017
N  3.658638 2.694231 0.00018
N  5.790052 -1.477733 0.000186
C  -1.134744 -0.047118 -0.000016
C  2.306475 0.649405 0.000132
C  2.316564 -0.795276 0.000108
C  -1.826367 -1.284562 -0.000043
C  -1.831548 1.187087 -0.000044
C  3.578835 1.326324 0.000154
C  -3.946655 -0.050468 -0.000131
C  -3.231162 -1.277086 -0.000095
C  -3.236641 1.179428 -0.000105
C  4.590532 -0.806777 0.000158
C  -5.431293 -0.10423 -0.00018
H  -1.254594 -2.214932 -0.000027
H  -1.267182 2.12226 -0.000015
H  -3.795286 -2.215055 -0.000103
H  -3.795793 2.118766 -0.000143
H  4.577565 3.133688 0.000214
H  2.81199 3.258761 0.000175
H  5.783255 -2.494509 0.000073
H  6.656348 -0.946721 0.000067
H  -7.007556 1.069421 -0.000138
