program: Gaussian 09
title: 000271896
version: EM64L-G09RevD.01
frameworkgroup: C1[X(C12H23N5O4)]
method: RPBEPBE
basis: SDD
operation: Freq
keyword: #p
keyword: freq=noraman
keyword: PBEPBE/SDD
title: #p freq=noraman PBEPBE/SDD
converged: YES YES NO NO
title: Mulliken charges:
elementType: O O O O N N N N N C C C C C C C C C C C C H H H H H H H H H H H H H H H H H H H H H H H
charge: -0.247508 -0.247481 -0.235816 -0.236051 -0.099692 -0.099863 -0.383055 -0.383303 -0.515117 -0.343322 -0.350816 -0.343377 -0.350810 -0.315956 -0.309575 -0.315844 -0.309641 -0.326582 -0.326427 0.287138 0.287334 0.207093 0.241638 0.206330 0.201437 0.241464 0.207038 0.201436 0.206353 0.221656 0.189214 0.189914 0.214207 0.221625 0.189256 0.189965 0.214214 0.243089 0.216913 0.216863 0.243211 0.299381 0.299412 0.304056
chargesum: 0.00000
title: Mulliken charges with hydrogens summed into heavy atoms:
elementType: O O O O N N N N N C C C C C C C C C C C C
charge: -0.247508 -0.247481 -0.235816 -0.236051 -0.099692 -0.099863 -0.083674 -0.083891 -0.211061 0.105410 0.056950 0.105125 0.056980 0.094914 0.094546 0.095037 0.094538 0.133419 0.133647 0.287138 0.287334
polarizability: 2.41132143e+02 -5.98350700e+00 1.52134592e+02 1.03642199e+01 3.89117243e+00 1.47596848e+02
1716.lowfreq: -17.2548 -4.5940 -0.0008 -0.0003 0.0008 2.1569 10.6738 16.2202 27.2836
frequency: 9.0758 15.0559 25.7526 39.0266 42.3933 49.5635 72.6102 89.5116 119.2112 144.0459 161.2842 202.2060 203.7281 235.8918 241.1454 252.3777 269.8172 278.2237 319.5428 333.8108 337.0393 388.0943 392.1168 425.5019 427.0893 465.1493 466.4237 477.7518 506.8053 514.3180 552.3795 553.2742 600.7069 601.8812 653.3269 672.6613 708.8055 746.2984 764.6351 786.3698 804.6451 806.0033 838.5933 838.7080 880.8652 895.9323 932.1199 950.1456 992.1309 992.5893 1024.1823 1024.5814 1040.2362 1048.7451 1051.7006 1055.1409 1079.6222 1084.4602 1087.6197 1103.6528 1106.3733 1115.5037 1125.0286 1141.4757 1164.3995 1164.8932 1172.7176 1190.5989 1191.1819 1232.4267 1234.6059 1237.7405 1270.5688 1271.0246 1287.4891 1290.9297 1295.2942 1296.3322 1330.6054 1331.3453 1343.5506 1344.0634 1365.6278 1366.8656 1370.4729 1370.7874 1389.1633 1394.6939 1416.1678 1441.5953 1443.3455 1446.1590 1447.2943 1449.7566 1450.1021 1455.7318 1457.3158 1461.4393 1466.3260 1473.0955 1485.2970 1641.8920 1682.0144 2879.9205 2880.1466 2902.9429 2903.5617 2945.5644 2946.5711 2951.3486 2951.7729 2957.5300 2957.7328 3018.5176 3018.6058 3024.9312 3025.0931 3056.6332 3056.7640 3080.4863 3080.7988 3088.6311 3089.0459 3527.8903 3532.0760 3535.4939
redmass: 4.9660 5.7182 3.8187 4.6533 3.4600 6.9251 8.1901 4.9432 6.1928 3.6534 3.5634 4.1981 3.8268 2.9827 2.1938 2.5351 3.5948 3.7977 3.6036 2.3162 2.3516 1.8652 1.8877 4.7772 4.9219 2.7177 2.7121 1.1883 2.3017 1.9809 1.9739 1.8930 1.9794 1.9047 6.3768 3.2722 8.9769 4.0677 3.8325 4.2279 3.7967 3.7268 1.6142 1.6183 2.5905 2.6301 4.3786 3.1174 2.7091 2.7142 2.2265 2.2281 2.8592 2.3511 1.8617 1.8929 3.2505 3.5818 4.1704 2.3991 2.5532 2.4906 2.6684 2.9289 2.7093 2.7058 2.2299 1.0695 1.0713 1.4759 1.1625 1.5624 1.2765 1.2750 1.3457 1.3283 1.3065 1.3670 1.2604 1.2547 1.2403 1.2467 1.3985 1.4034 1.2639 1.2617 1.3288 1.3288 1.9269 1.0839 1.0826 1.0815 1.0799 1.1003 1.0981 1.1420 1.1176 1.3417 1.1832 1.2046 1.7150 5.6848 8.8771 1.0691 1.0688 1.0698 1.0698 1.0629 1.0628 1.0666 1.0665 1.0668 1.0669 1.0917 1.0916 1.0983 1.0982 1.0909 1.0909 1.0965 1.0964 1.0971 1.0970 1.0776 1.0769 1.0764
irintensity: 0.1348 0.4606 0.4875 0.5636 1.0170 13.4890 2.7534 0.0388 0.3481 0.1554 16.3607 15.4743 0.5241 2.6494 0.9014 0.3355 16.5693 1.5353 4.4037 9.9105 5.1271 0.3822 0.4027 5.8863 0.2002 2.6939 2.4756 95.2457 36.9805 52.0577 97.7120 112.8444 14.3386 28.0506 0.9325 3.1065 57.7080 2.9171 16.0121 3.9490 19.6275 11.6932 0.1258 0.3695 17.9343 3.9620 0.0585 25.8806 74.0389 67.6258 16.3949 11.4840 3.0306 5.7926 10.5152 22.7587 3.8348 101.3861 27.8512 47.4857 2.5267 438.1506 7.5410 9.1328 24.3679 4.9347 561.2273 1.4732 2.0395 0.0504 6.1775 12.6563 17.7904 6.6010 90.8770 23.5480 3.0481 12.8793 4.1419 1.3598 19.5083 4.8000 17.1297 9.0678 3.1932 1.7705 51.4749 0.3541 306.6443 0.9086 1.2090 7.6824 1.6270 41.5204 15.7648 149.1034 63.0537 403.1136 11.7424 200.4553 3.5279 127.8179 265.2608 109.2043 46.5426 47.5618 61.1813 48.3433 43.6379 42.1883 42.0680 83.0356 121.6018 28.1724 39.9019 39.1614 59.1970 24.3436 20.7804 46.5713 39.0184 25.8112 31.9043 0.2481 34.3163 23.8702
temp: 298.150 k
press: 1.00000 atm
elementType: 8 8 8 8 7 7 7 7 7 6 6 6 6 6 6 6 6 6 6 6 6 1 1 1 1 1 1 1 1 1 1 1 1 1 1 1 1 1 1 1 1 1 1 1
symmnumber: 1
zpe: 967192.3 jmol-1
zpe.correction: 0.368384 hartree
zpe.thermalcorrener: 0.389705 hartree
zpe.thermalcorrenthalpy: 0.390649 hartree
zpe.thermalcorrgfe: 0.313728 hartree
zpe.sumelectzpe: -1044.029584 hartree
zpe.sumelectthermal: -1044.008263 hartree
zpe.sumelectthermalent: -1044.007319 hartree
zpe.sumelectthermalfe: -1044.084241 hartree
dipole: -0.0038 -6.6343 -3.8278
dipole: 7.6594
quadrupole: -133.1526 -122.4696 -124.6755
quadrupole: -7.3597 12.6793 1.9046
quadrupole: -6.3867 4.2963 2.0904 -7.3597 12.6793 1.9046
hfenergy: -1044.3979685 hartree
pointgroup: C01 [X(C12H23N5O4)]
dipole: 0.0035085 3.0132557 -0.0321213 debye
polarizability: 241.5036193|-0.2515198|154.3691944|-10.3653132|-0.0994396|144.9907688 unknown
InChI: InChI=1S/C12H23N5O4/c18-11(13-9-16-1-5-20-6-2-16)15-12(19)14-10-17-3-7-21-8-4-17/h13-15H,1-10H2
charge 0 multiplicity 1
44 atoms
O  6.54838 -1.026544 0.967858
O  -6.559718 -1.02042 -0.928857
O  0.971915 -0.42182 -1.185913
O  -0.96265 -0.394146 1.188189
N  4.489286 0.571885 -0.294467
N  -4.484594 0.591596 0.289188
N  2.260304 1.467233 -0.645368
N  -2.249661 1.484372 0.609117
N  0.004483 1.3978 -0.020011
C  4.162223 -0.734496 0.342267
C  5.88019 0.567835 -0.817246
C  -4.168641 -0.729914 -0.32143
C  -5.872692 0.606927 0.819105
C  5.162214 -1.019042 1.472246
C  6.854761 0.265162 0.335169
C  -5.176088 -1.032278 -1.440083
C  -6.85502 0.286058 -0.321664
C  3.487034 0.995831 -1.295152
C  -3.474564 1.031013 1.275173
C  1.086683 0.710144 -0.64978
C  -1.07714 0.725831 0.627334
H  4.198094 -1.563721 -0.404361
H  3.136135 -0.69607 0.748694
H  6.11195 1.562846 -1.244731
H  6.022122 -0.196965 -1.620225
H  -3.144355 -0.70612 -0.733524
H  -4.205636 -1.543052 0.442656
H  -6.014775 -0.139785 1.638872
H  -6.096364 1.612135 1.226561
H  5.000697 -2.020418 1.903038
H  5.059022 -0.248424 2.266534
H  6.794953 1.078297 1.091091
H  7.89003 0.175306 -0.033601
H  -5.022892 -2.043656 -1.850061
H  -5.07209 -0.279567 -2.251237
H  -6.794417 1.082913 -1.094643
H  -7.888858 0.210106 0.054186
H  3.180625 0.181512 -1.988018
H  3.933512 1.817959 -1.885936
H  -3.914076 1.866678 1.852056
H  -3.167389 0.229308 1.982209
H  2.37795 2.198936 0.059565
H  -2.368548 2.200274 -0.111642
H  0.005005 2.420182 -0.031554
