program: Gaussian 09
title: 000271882
version: EM64L-G09RevD.01
frameworkgroup: C1[X(C9H21NO2)]
method: RPBEPBE
basis: SDD
operation: Freq
keyword: #p
keyword: freq=noraman
keyword: PBEPBE/SDD
title: #p freq=noraman PBEPBE/SDD
converged: YES YES NO NO
title: Mulliken charges:
elementType: O O N C C C C C C C C C H H H H H H H H H H H H H H H H H H H H H
charge: -0.434775 -0.269124 -0.303223 -0.088401 -0.422313 -0.415340 -0.364953 -0.050571 -0.279854 -0.701136 -0.683593 -0.498742 0.207593 0.177376 0.234678 0.224479 0.186402 0.209470 0.229025 0.203909 0.239823 0.183802 0.181901 0.207300 0.198498 0.235467 0.229927 0.211941 0.201997 0.320959 0.232553 0.197656 0.197267
chargesum: 0.00000
title: Mulliken charges with hydrogens summed into heavy atoms:
elementType: O O N C C C C C C C C C
charge: -0.113816 -0.269124 -0.063400 0.119192 -0.010259 -0.004459 0.073541 0.153338 0.085850 -0.059871 -0.039727 0.128734
polarizability: 1.39034067e+02 5.88957904e-01 1.09050381e+02 -5.08370235e-01 1.34043185e+00 9.61106440e+01
1716.lowfreq: -7.3957 -0.0010 -0.0005 0.0008 3.3766 14.7130 28.5669 30.5055 47.3174
frequency: 28.2227 30.4410 47.2573 63.0599 96.3359 100.1056 115.7896 135.1411 166.5489 201.7300 217.5496 223.3805 232.1082 248.6356 289.2217 317.4567 348.0974 381.6710 413.1673 436.6442 460.0058 502.7842 540.0712 659.1953 765.2100 821.5709 830.3590 868.7312 901.5948 907.2009 916.0128 936.5909 949.2451 1019.4365 1049.5424 1063.8268 1066.4136 1089.5547 1101.2308 1111.8796 1123.5637 1130.4093 1140.9799 1157.4715 1166.5764 1177.7125 1231.0944 1233.2682 1266.1216 1274.8801 1286.9472 1309.1487 1318.6284 1326.8096 1361.4539 1363.6356 1364.2818 1373.2760 1384.1092 1388.9394 1437.8640 1446.9063 1456.4462 1462.4415 1462.6079 1463.4212 1467.4883 1477.9378 1478.8233 1481.7116 1484.2650 1493.2680 2895.9827 2905.9260 2919.3273 2939.1348 2942.1663 2967.0956 2970.7366 2975.3899 2982.5004 2988.0218 2997.6620 3016.2530 3028.0841 3060.8253 3066.2450 3070.7203 3071.5624 3093.5893 3098.4720 3416.2038 3542.1136
redmass: 2.9885 3.3451 1.9049 3.3208 3.5407 2.6826 2.6369 2.4973 2.5537 1.0410 2.0862 1.2796 2.9182 1.2671 2.0418 1.3377 3.1720 2.8806 2.7862 2.2282 2.7207 2.3970 3.0459 1.5335 1.2033 2.2575 1.9900 1.8686 2.9370 1.2931 1.8530 1.4833 1.7652 3.6030 1.5466 4.1698 2.3167 2.3499 3.1413 1.3174 2.1413 2.0081 1.6147 1.3880 1.5308 2.1183 1.4088 1.6498 1.2527 1.1374 1.1786 1.4139 1.2603 1.3002 1.3851 1.3713 1.2758 1.2716 1.4189 1.2308 1.1607 1.1606 1.0515 1.0675 1.0583 1.0544 1.0653 1.0718 1.0762 1.0843 1.0582 1.0864 1.0532 1.0643 1.0357 1.0669 1.1044 1.0356 1.0727 1.0487 1.0925 1.1023 1.0605 1.0875 1.0927 1.0987 1.1029 1.0975 1.0995 1.1001 1.0967 1.0737 1.0657
irintensity: 0.6802 0.1087 7.1484 0.2275 0.0438 0.9641 0.4458 5.1367 0.6501 0.1854 1.4873 4.8355 8.5471 2.2490 21.8257 113.0629 21.2435 11.1935 0.7468 1.8293 17.9252 10.3180 11.0697 100.4211 2.2024 2.1639 10.3123 4.9802 28.2306 0.8781 11.7856 3.5228 21.7378 20.2249 27.7831 57.7176 31.8848 39.6772 45.9912 4.6569 13.9013 10.9087 15.2237 8.3812 5.5714 76.6784 9.9584 3.7062 20.6011 1.1856 3.5939 8.2284 5.4927 4.4946 5.4278 31.1455 10.1103 21.7659 18.0568 26.6707 0.7181 24.9808 11.6625 1.9894 4.2736 4.7047 13.5593 9.2228 1.8837 6.5106 15.5120 8.4948 52.4830 71.2278 102.1951 24.4959 71.5055 28.4130 9.7641 38.2451 24.4926 79.8711 19.9868 27.0469 34.4581 4.9137 49.3912 91.7079 40.8161 38.7074 34.8790 1.3334 5.0000
temp: 298.150 k
press: 1.00000 atm
elementType: 8 8 7 6 6 6 6 6 6 6 6 6 1 1 1 1 1 1 1 1 1 1 1 1 1 1 1 1 1 1 1 1 1
symmnumber: 1
zpe: 769160.1 jmol-1
zpe.correction: 0.292958 hartree
zpe.thermalcorrener: 0.309255 hartree
zpe.thermalcorrenthalpy: 0.310199 hartree
zpe.thermalcorrgfe: 0.247572 hartree
zpe.sumelectzpe: -559.686397 hartree
zpe.sumelectthermal: -559.670100 hartree
zpe.sumelectthermalent: -559.669155 hartree
zpe.sumelectthermalfe: -559.731782 hartree
dipole: -1.5815 -1.9783 2.2812
dipole: 3.4086
quadrupole: -71.8143 -81.9933 -73.1129
quadrupole: -4.8709 7.0563 4.1584
quadrupole: 3.8259 -6.3532 2.5273 -4.8709 7.0563 4.1584
hfenergy: -559.9793544 hartree
pointgroup: C01 [X(C9H21N1O2)]
dipole: -0.6580984 0.8028071 -0.849005 debye
polarizability: 139.0469232|0.3417776|108.874249|-0.1266721|1.9918714|96.2739193 unknown
InChI: InChI=1S/C9H21NO2/c1-8(2)10-7-9(11)5-4-6-12-3/h8-11H,4-7H2,1-3H3
charge 0 multiplicity 1
33 atoms
O  0.168637 -2.677172 -0.064308
O  4.416618 0.516778 0.380785
N  -2.229166 0.203196 0.396294
C  -0.236791 -1.291643 0.268032
C  0.744293 -0.255184 -0.309253
C  -1.699818 -1.051291 -0.178556
C  2.143348 -0.319091 0.340667
C  -3.470655 0.749947 -0.21371
C  3.135636 0.637994 -0.324543
C  -3.764033 2.129029 0.41141
C  -4.705231 -0.187974 -0.099121
C  5.440864 1.393557 -0.177957
H  -0.185667 -1.278405 1.373809
H  0.825255 -0.417157 -1.407846
H  0.291239 0.745594 -0.167271
H  -2.28317 -1.96382 0.086673
H  -1.732139 -0.955343 -1.284712
H  2.070189 -0.060095 1.41464
H  2.540725 -1.349549 0.284852
H  -3.248797 0.895859 -1.291356
H  -2.316596 0.14275 1.421865
H  2.769161 1.689796 -0.268982
H  3.269091 0.380119 -1.401543
H  -4.652627 2.59341 -0.052879
H  -3.964978 2.031724 1.496856
H  -2.900176 2.803456 0.281625
H  -4.498678 -1.181391 -0.537419
H  -5.577337 0.240672 -0.627786
H  -4.986701 -0.33205 0.96213
H  0.25888 -2.742886 -1.050011
H  6.35343 1.225419 0.415769
H  5.148117 2.46395 -0.106125
H  5.647578 1.155002 -1.244231
