program: Gaussian 09
title: 000271880
version: EM64L-G09RevD.01
frameworkgroup: C1[X(C10H12O)]
method: RPBEPBE
basis: SDD
operation: Freq
keyword: #pfreq=noraman
keyword: PBEPBE/SDD
title: #p freq=noraman PBEPBE/SDD
converged: YES YES NO NO
title: Mulliken charges:
elementType: O C C C C C C C C C C H H H H H H H H H H H H
charge: -0.435775 -0.236424 -0.459253 -0.558454 0.238961 0.289468 -0.362750 -0.416909 -0.420337 -0.240964 -0.228191 0.228733 0.215686 0.243033 0.223200 0.226640 0.220599 0.187994 0.242671 0.241433 0.226965 0.226136 0.347540
chargesum: 0.00000
title: Mulliken charges with hydrogens summed into heavy atoms:
elementType: O C C C C C C C C C C
charge: -0.088235 -0.007691 -0.000534 -0.108615 0.238961 0.289468 0.045842 -0.174238 -0.178904 -0.014000 -0.002055
polarizability: 1.27315029e+02 6.01343369e+00 1.13113108e+02 -1.14032148e+01 7.01003424e+00 6.87029800e+01
1716.lowfreq: -13.8876 -0.0004 -0.0002 0.0005 3.9648 14.7961 79.8366 88.6720 170.4211
frequency: 79.7940 88.6622 170.4177 195.6498 250.2564 264.9535 367.1922 411.6529 433.6607 489.4460 508.6365 541.9667 604.5558 646.7965 718.1303 732.8281 764.3158 809.2821 841.2481 878.6558 899.4431 923.4038 944.2227 986.3405 987.8845 993.6707 1024.5480 1055.8259 1064.1302 1094.1268 1138.5826 1162.1956 1170.6444 1177.6775 1187.0305 1217.5617 1251.6817 1264.3342 1287.3418 1300.9755 1316.0541 1340.0405 1377.3348 1387.3224 1444.2031 1459.1917 1473.3869 1475.2667 1479.7576 1594.4257 1614.3425 2939.8357 2957.6746 2973.4144 3005.6488 3043.3655 3067.6084 3076.5319 3112.9228 3122.1788 3137.6863 3158.6920 3531.6865
redmass: 4.0319 4.5126 2.4244 2.7765 2.4367 3.1387 1.2681 2.6938 2.5000 3.4416 4.2382 4.7168 2.9439 3.6873 3.9882 2.5750 1.3101 3.1211 2.5313 1.3753 1.7878 2.8589 1.3706 1.9287 1.3932 2.0015 2.1221 2.6733 1.9547 1.9624 1.2384 1.6526 1.0949 1.3999 1.4198 1.8320 1.3705 1.2658 1.8746 1.4876 1.3693 1.4252 1.2376 6.1700 2.3657 1.2507 1.1641 1.5414 1.2460 6.8695 6.9738 1.0726 1.0796 1.0652 1.0621 1.0953 1.0941 1.1041 1.0872 1.0882 1.0935 1.1001 1.0656
irintensity: 0.4539 2.2697 3.0162 2.7891 4.7034 5.8675 124.8930 10.3734 10.8239 0.9738 3.9017 8.6518 1.3009 4.5029 0.4462 13.1485 70.8177 5.2800 3.0098 0.2666 10.2839 37.4221 2.5644 13.1651 0.0765 1.5238 6.0414 28.4926 6.3854 13.7542 15.4777 0.4384 0.2889 9.5080 0.8591 0.8669 2.8679 0.4757 6.9323 1.3075 9.2211 16.2517 18.6661 4.5277 4.5719 11.2613 0.6699 17.2792 17.4243 0.7135 1.2602 25.9540 85.4799 34.6222 28.1657 28.0178 34.6018 41.7164 9.1087 2.3351 30.0397 31.4099 3.2843
temp: 298.150 k
press: 1.00000 atm
elementType: 8 6 6 6 6 6 6 6 6 6 6 1 1 1 1 1 1 1 1 1 1 1 1
symmnumber: 1
zpe: 508522.3 jmol-1
zpe.correction: 0.193686 hartree
zpe.thermalcorrener: 0.203144 hartree
zpe.thermalcorrenthalpy: 0.204088 hartree
zpe.thermalcorrgfe: 0.159028 hartree
zpe.sumelectzpe: -462.670118 hartree
zpe.sumelectthermal: -462.660660 hartree
zpe.sumelectthermalent: -462.659715 hartree
zpe.sumelectthermalfe: -462.704775 hartree
dipole: -1.2780 0.6668 -1.4260
dipole: 2.0277
quadrupole: -66.4730 -60.8603 -68.7407
quadrupole: 3.3794 -7.7407 2.7181
quadrupole: -1.1150 4.4977 -3.3827 3.3794 -7.7407 2.7181
hfenergy: -462.8638037 hartree
pointgroup: C01 [X(C10H12O1)]
dipole: 0.5226658 0.2707045 0.5384628 debye
dipolederiv: -0.2774525 -0.1179138 0.0309091 -0.1968636 -0.6121422 -0.1219863 -0.0667646 -0.1192586 -0.6981076 -0.0004748 -0.0364327 -0.0270736 -0.0846856 0.0111181 -0.000146 0.0474193 -0.0046996 0.124605 0.0523009 -0.0866871 -0.0522471 -0.0476222 -0.0083436 0.0789846 0.0155454 0.0126159 0.085792 0.0045528 0.0160019 0.02479 0.0707914 -0.0127105 -0.0093568 0.0537705 -0.0195145 0.1748739 0.140582 -0.0435268 -0.0563593 0.0770163 -0.216393 -0.0274069 -0.1980271 0.0216419 -0.042914 -0.0768808 -0.1279356 0.0191485 -0.2448047 0.2150353 0.0247772 0.0053904 0.040514 -0.0505867 0.2961106 0.0495335 -0.0413849 0.120268 0.3670816 0.0570584 -0.0119655 0.0411269 0.5759218 -0.0794861 0.027542 -0.0485165 0.0130055 0.0544273 -0.057214 -0.0396818 -0.0839966 -0.140077 -0.0319085 0.1177818 -0.0729388 0.0924224 0.0205985 -0.0652234 -0.047407 -0.0799983 -0.1227692 -0.0511583 -0.0249602 -0.0239443 -0.0946154 0.0428667 -0.0159631 -0.014402 -0.036691 -0.1560201 0.0523511 -0.0296978 -0.0685502 0.0374295 -0.0638946 -0.0392531 -0.0764034 -0.0153933 -0.1295297 -0.0207534 0.0016754 0.0226213 0.0250118 0.0364905 -0.0272737 0.0532466 -0.0009237 -0.17538 -0.0851202 0.1045472 0.0807815 0.1071199 -0.0169017 -0.0532474 0.112003 -0.0808276 0.0261395 0.0380597 -0.0102439 -0.0427812 -0.0366996 0.1007308 -0.0341471 -0.0868109 0.0178591 -0.0773898 0.0120052 0.0131582 -0.0310514 0.0007396 -0.0435138 -0.089413 -0.0322934 -0.1517643 -0.059188 0.0293086 -0.0077722 0.026736 0.0012134 -0.0412078 0.0944413 0.0032283 0.1649061 -0.0432153 -0.1609502 0.0277176 0.0692703 0.0692936 0.0744987 -0.0334874 0.0028898 -0.0188757 0.0345958 0.0726484 0.0560055 -0.0563321 -0.017712 -0.1651931 0.1229044 -0.0148613 0.0846819 -0.1127212 0.0548746 -0.0939015 0.0559257 -0.0657644 -0.0486079 0.0606665 0.0504889 0.0732161 0.1144764 0.0450328 -0.0567064 0.0406973 -0.0874985 -0.0572591 0.0711469 0.0496454 0.067534 0.1230616 0.0183079 0.1001915 0.0167212 0.1118606 -0.0701628 0.0186457 0.0191261 0.0176487 0.1498155 -0.120551 0.0177429 0.0805157 0.0168466 0.0870757 0.0106188 0.087373 0.0104699 0.1299994 0.0886014 0.1038803 0.053063 0.1332472 0.3464071 0.0348744 0.0884905 0.0597287 0.2686178 unknown
polarizability: 126.3823752|-5.8821459|112.9266155|-14.0745939|-6.6715633|69.8221257 unknown
InChI: InChI=1S/C10H12O/c11-7-9-6-5-8-3-1-2-4-10(8)9/h1-4,9,11H,5-7H2
charge 0 multiplicity 1
23 atoms
O  -2.417668 -1.326765 -1.115052
C  -1.492057 0.05233 0.765297
C  -1.768781 1.439636 0.100747
C  -0.378404 2.136369 -0.017022
C  -0.03672 -0.222561 0.37701
C  0.593139 0.964528 -0.080622
C  -2.474364 -1.056845 0.32743
C  0.677634 -1.438235 0.429961
C  1.942634 0.943858 -0.486378
C  2.03329 -1.461657 0.015315
C  2.660896 -0.277413 -0.439574
H  -1.566302 0.139326 1.871465
H  -2.50118 2.039039 0.66915
H  -2.181259 1.258392 -0.90952
H  -0.169447 2.753843 0.88053
H  -0.307746 2.806494 -0.892785
H  -3.515701 -0.743389 0.513491
H  -2.283524 -1.986593 0.907166
H  0.199534 -2.357862 0.790832
H  2.433819 1.858048 -0.840439
H  2.598183 -2.40021 0.0462
H  3.708436 -0.306815 -0.760493
H  -1.474114 -1.521515 -1.35431
