program: Gaussian 09
title: 000271888
version: EM64L-G09RevD.01
frameworkgroup: C1[X(C11H20N2O)]
method: RPBEPBE
basis: SDD
operation: Freq
keyword: #p
keyword: freq=noraman
keyword: PBEPBE/SDD
title: #p freq=noraman PBEPBE/SDD
converged: YES YES NO NO
title: Mulliken charges:
elementType: O N N C C C C C C C C C C C H H H H H H H H H H H H H H H H H H H H
charge: -0.310521 -0.437677 -0.657812 0.356213 0.360135 -0.198428 -0.124266 -0.572293 -0.546680 -0.481263 -0.816064 -0.784672 -0.789118 0.260340 0.239873 0.296576 0.194657 0.235701 0.252580 0.195666 0.234650 0.196343 0.225472 0.208846 0.225380 0.241859 0.209705 0.216889 0.214906 0.211262 0.232495 0.274078 0.296592 0.338575
chargesum: 0.00000
title: Mulliken charges with hydrogens summed into heavy atoms:
elementType: O N N C C C C C C C C C C C
charge: -0.310521 -0.163599 -0.022645 0.356213 0.360135 0.041445 0.172309 -0.141934 -0.098433 -0.050271 -0.156366 -0.116220 -0.130455 0.260340
polarizability: 1.50826286e+02 1.02736487e+00 1.25861171e+02 3.63975679e+00 2.86158367e+00 1.10543067e+02
1716.lowfreq: -23.9703 -13.9463 -10.8668 0.0005 0.0007 0.0008 12.2349 61.2199 69.9872
frequency: 11.8967 61.1389 69.9619 141.3042 179.5479 199.0911 212.4426 218.5347 230.7458 238.5248 248.9536 285.8112 309.2811 346.1049 356.2801 393.8551 417.2436 446.6194 465.7216 497.7874 518.2183 534.8081 555.9261 579.1320 630.1098 637.3007 712.6240 729.7566 781.7323 821.7050 830.2814 886.2568 913.0947 923.1797 939.4235 943.8486 952.0804 958.1904 986.5768 996.2733 1028.0889 1030.1485 1048.6647 1074.8978 1094.6135 1123.2231 1145.0470 1154.5140 1175.9322 1190.1630 1203.9044 1219.2292 1236.2133 1242.1047 1266.6883 1269.2602 1286.1766 1299.3398 1306.0330 1317.4164 1363.7002 1380.6506 1388.3260 1403.1156 1461.2105 1462.6357 1468.8317 1475.4672 1479.3292 1483.8864 1486.4247 1494.5928 1500.4446 1507.2414 1599.4676 1647.3107 2971.3782 2975.8482 2981.0233 2991.7134 2997.0106 3005.9502 3035.2072 3039.7623 3046.3750 3054.8797 3057.3545 3059.2904 3062.5111 3065.7879 3068.0501 3088.0979 3092.2259 3539.6470 3548.1900 3701.9758
redmass: 5.2112 3.2578 3.7580 1.2639 1.3551 1.5815 1.1144 1.9178 2.7948 2.0829 1.6195 3.0468 2.2835 2.3331 2.6916 2.4491 2.0465 1.3277 2.0753 2.0606 1.8214 1.9506 4.1146 3.4520 4.6007 3.3584 9.3244 2.5455 2.2097 1.5321 2.2342 2.1614 2.1737 2.1956 1.7805 1.4765 1.9446 2.0827 2.1281 1.5210 1.6546 1.7655 2.2238 1.3564 1.4315 2.0261 2.2540 2.0436 2.2256 1.6666 1.9694 2.2367 1.7210 2.0570 1.7383 1.5974 1.4605 1.4749 1.7604 1.9936 1.5553 1.2188 1.2356 1.2011 1.0598 1.0567 1.0577 1.0964 1.1334 1.1294 1.1151 1.3150 1.0839 1.2220 1.3274 3.5214 1.0360 1.0374 1.0377 1.0595 1.0622 1.0627 1.1016 1.0888 1.0897 1.0989 1.1013 1.0983 1.0977 1.1010 1.0986 1.0966 1.0962 1.0555 1.0664 1.1038
irintensity: 9.7064 2.7326 10.7509 2.9968 2.0426 3.6270 0.4295 3.0207 2.9971 2.3904 5.5852 1.2248 2.0374 1.2105 1.9305 7.2022 0.0326 301.1308 62.0394 3.8689 25.9455 23.1865 6.9054 1.6320 0.3095 3.9941 16.2888 2.2505 13.4179 0.3315 3.4244 1.8890 0.9502 1.8620 4.7473 1.3876 7.8800 1.3899 2.0313 2.7715 0.8383 9.2344 1.9036 2.4979 0.9248 17.2077 16.6970 8.5154 15.4800 1.1400 7.5099 4.4624 1.0261 8.0188 3.8403 1.0896 23.6137 3.6920 41.6077 22.6547 120.3248 33.9903 16.5586 20.1475 0.8004 6.7688 2.0937 15.5784 77.3703 53.1817 54.2838 188.7456 5.5363 126.8229 104.6923 269.5942 25.3046 26.6852 56.0029 40.0974 36.2870 60.1288 3.2376 5.1994 37.8639 7.6589 17.1541 29.4853 51.2771 111.3703 27.7211 44.6334 30.4396 34.6328 7.0199 35.6381
temp: 298.150 k
press: 1.00000 atm
elementType: 8 7 7 6 6 6 6 6 6 6 6 6 6 6 1 1 1 1 1 1 1 1 1 1 1 1 1 1 1 1 1 1 1 1
symmnumber: 1
zpe: 782704.3 jmol-1
zpe.correction: 0.298116 hartree
zpe.thermalcorrener: 0.313155 hartree
zpe.thermalcorrenthalpy: 0.314099 hartree
zpe.thermalcorrgfe: 0.256199 hartree
zpe.sumelectzpe: -614.805253 hartree
zpe.sumelectthermal: -614.790215 hartree
zpe.sumelectthermalent: -614.789270 hartree
zpe.sumelectthermalfe: -614.847171 hartree
dipole: -0.5367 4.0049 1.1078
dipole: 4.1898
quadrupole: -80.2906 -87.2123 -87.7489
quadrupole: 13.6490 5.5227 0.1761
quadrupole: 4.7933 -2.1284 -2.6650 13.6490 5.5227 0.1761
hfenergy: -615.1033697 hartree
pointgroup: C01 [X(C11H20N2O1)]
dipole: -0.2166505 -1.4622522 -0.7294124 debye
polarizability: 151.0391824|-1.2830423|124.3396581|-1.8538349|5.4866375|111.8516829 unknown
InChI: InChI=1S/C11H20N2O/c1-10(2)7-4-5-11(10,3)8(6-7)13-9(12)14/h7-8,13H,4-6,12H2,1-3H3
charge 0 multiplicity 1
34 atoms
O  3.014929 1.20251 0.834791
N  1.73499 -0.62357 0.100616
N  4.070154 -0.594282 -0.209607
C  -0.534558 0.374991 -0.588599
C  -1.904658 0.436582 0.213013
C  -1.796762 -1.058978 0.690377
C  0.451699 -0.079513 0.555925
C  -0.769886 -0.858597 -1.519978
C  -0.408967 -1.094107 1.396134
C  -1.642592 -1.835806 -0.651264
C  -0.077616 1.639777 -1.318256
C  -1.934017 1.465508 1.370985
C  -3.141057 0.727099 -0.673515
C  2.935374 0.064801 0.275717
H  -2.630882 -1.411321 1.321554
H  0.728225 0.803855 1.156777
H  0.184077 -1.308255 -1.852921
H  -1.297489 -0.551585 -2.441169
H  -0.46534 -0.78634 2.454691
H  0.029621 -2.10973 1.37905
H  -2.621649 -2.03134 -1.123757
H  -1.15742 -2.81681 -0.493393
H  0.89636 1.474167 -1.815638
H  -0.804893 1.942944 -2.095062
H  0.057994 2.484765 -0.618397
H  -1.1274 1.33141 2.110139
H  -2.895364 1.393369 1.914267
H  -1.855487 2.49576 0.975855
H  -3.123215 1.775014 -1.028187
H  -4.069187 0.59478 -0.084995
H  -3.21457 0.077287 -1.561279
H  1.739665 -1.549121 -0.329235
H  4.049407 -1.499415 -0.673995
H  4.959611 -0.117649 -0.089344
