program: Gaussian 09
title: 000271908
version: EM64L-G09RevD.01
frameworkgroup: C1[X(C19H20O3)]
method: RPBEPBE
basis: SDD
operation: Freq
keyword: #pfreq=noraman
keyword: PBEPBE/SDD
title: #p freq=noraman PBEPBE/SDD
converged: YES YES NO NO
title: Mulliken charges:
elementType: O O O C C C C C C C C C C C C C C C C C C C H H H H H H H H H H H H H H H H H H H H
charge: -0.245857 -0.247700 -0.210025 -0.155523 -0.609742 -0.383319 0.497423 0.250885 -0.720660 -0.414137 -0.408307 -0.422688 -0.236343 -0.229888 -0.243123 0.143337 0.291047 -0.337996 -0.339901 -0.240510 -0.224405 -0.219250 0.248126 0.213684 0.233123 0.199098 0.222140 0.281430 0.208113 0.203770 0.252573 0.229384 0.258483 0.257922 0.223642 0.222366 0.226087 0.242496 0.278055 0.233619 0.236442 0.236128
chargesum: 0.00000
title: Mulliken charges with hydrogens summed into heavy atoms:
elementType: O O O C C C C C C C C C C C C C C C C C C C
charge: -0.245857 -0.247700 -0.210025 0.092602 -0.162935 0.037920 0.497423 0.250885 -0.027348 -0.161564 -0.178923 0.093717 -0.012701 -0.007522 -0.017035 0.143337 0.291047 -0.095500 -0.061845 -0.006891 0.012037 0.016877
polarizability: 2.43782599e+02 8.39946017e+00 2.37106861e+02 -2.11708506e+01 -2.49077426e-01 1.42560855e+02
1716.lowfreq: -3.0879 -0.7462 0.0005 0.0006 0.0008 7.6187 16.8970 21.5210 29.2633
frequency: 16.1373 21.4385 29.1914 41.9251 48.6384 58.4633 63.6800 79.4873 107.0108 138.4839 152.3701 167.8121 190.2683 197.2589 250.2597 264.0341 289.9033 309.4244 334.3435 348.3582 393.3088 397.6853 405.8144 408.1620 434.0406 477.0785 529.1905 556.6430 578.8363 613.0679 617.8595 626.0197 661.3112 694.8477 701.2664 706.9827 753.0947 760.4774 776.1025 789.0788 806.7898 818.5566 855.0558 857.8432 895.7709 920.3298 934.8769 937.1697 962.0279 977.4375 989.4949 989.8594 990.1917 992.8608 993.8934 1005.9733 1013.8080 1024.2997 1027.9808 1036.5452 1052.1841 1082.4630 1087.5350 1094.8514 1105.3625 1116.6159 1170.8376 1175.0971 1181.2387 1188.5429 1190.4619 1218.1216 1231.4314 1242.4614 1247.4792 1268.7027 1311.7110 1315.6810 1324.4344 1332.5653 1333.9591 1364.5631 1382.9927 1388.7102 1405.9806 1415.4141 1437.6080 1441.3656 1462.5726 1471.7234 1480.1754 1480.9652 1483.8046 1495.2261 1577.6011 1592.7131 1602.4427 1614.5214 1616.9046 1645.3870 2976.1179 2978.9603 2992.5635 2997.2232 3023.3915 3037.7689 3058.7768 3071.0582 3086.0650 3087.7189 3111.9211 3120.4244 3130.6232 3133.0130 3138.5134 3143.4026 3149.4764 3159.9199 3160.8073 3170.8815
redmass: 4.3607 5.7924 5.0056 3.9329 5.6344 4.5951 4.2578 6.2482 2.2561 4.3820 5.3115 4.3047 4.1150 1.9797 1.4259 4.3994 4.2709 5.1192 4.2248 2.3811 3.3363 2.8174 2.8273 3.2502 5.8562 4.7795 3.4403 2.6148 4.7925 6.4311 6.1426 3.4620 6.1498 1.8273 4.5918 1.7408 2.0417 1.8236 1.9645 5.6248 3.8330 1.7629 1.2489 1.2517 1.9164 1.5121 2.3997 1.6791 2.2739 1.3916 4.7083 3.3470 3.1250 1.6090 1.3548 3.3500 1.4682 2.5234 2.1568 2.4881 2.0554 1.8096 1.6241 3.5233 1.8246 2.0326 1.0648 1.0652 1.2614 1.1268 1.1255 2.4149 2.9735 1.1266 1.3017 1.2092 1.3751 1.3622 1.3690 1.3032 1.4269 1.6152 6.1968 9.2228 1.2004 1.1167 2.2643 2.1475 1.0973 1.1117 1.1131 1.9443 2.2697 1.0537 6.5592 6.0286 6.8219 6.1284 7.2983 9.0260 1.0488 1.0476 1.0600 1.0605 1.0911 1.0967 1.1005 1.0991 1.0999 1.1007 1.0869 1.0860 1.0852 1.0915 1.0882 1.0962 1.0925 1.0962 1.1015 1.1015
irintensity: 0.0606 0.6965 0.8298 0.1250 0.3596 1.6560 1.3928 1.6434 0.3957 1.0010 0.4889 1.2722 3.1068 2.4225 3.1992 0.0447 10.7770 2.1872 9.7701 11.8088 2.3619 0.0725 0.0074 0.7377 0.0817 22.1345 10.0365 5.0613 4.2469 0.2367 0.2968 5.3806 15.9760 47.9207 11.0614 50.6119 81.3884 27.6366 13.7061 4.0485 3.3412 3.0884 0.2464 0.8037 6.7614 2.8927 23.2752 7.7256 80.7185 0.8060 0.5251 7.2961 2.9430 4.5631 1.6556 5.9279 0.6199 2.9236 7.0150 3.9483 0.7048 9.8412 15.6133 234.1324 37.4697 93.8668 2.1365 2.6293 29.7442 0.0450 12.0457 0.4384 120.1737 7.5704 1.8789 3.7663 1.4326 1.7753 7.1153 1.6683 38.2110 39.5510 0.9835 1.8449 11.1378 28.2822 23.6330 6.2406 0.3417 22.4078 5.6551 3.5985 16.5834 15.4442 71.7013 1.5526 74.6522 7.0398 26.0219 100.6675 32.4419 42.1483 44.2167 33.2597 10.2865 6.4926 14.9357 55.8635 4.0148 11.9707 8.9837 0.4740 1.0261 16.0762 5.0068 40.7346 17.3297 16.6454 23.1572 22.8138
temp: 298.150 k
press: 1.00000 atm
elementType: 8 8 8 6 6 6 6 6 6 6 6 6 6 6 6 6 6 6 6 6 6 6 1 1 1 1 1 1 1 1 1 1 1 1 1 1 1 1 1 1 1 1
symmnumber: 1
zpe: 893497.7 jmol-1
zpe.correction: 0.340315 hartree
zpe.thermalcorrener: 0.361203 hartree
zpe.thermalcorrenthalpy: 0.362147 hartree
zpe.thermalcorrgfe: 0.286827 hartree
zpe.sumelectzpe: -960.104239 hartree
zpe.sumelectthermal: -960.083351 hartree
zpe.sumelectthermalent: -960.082407 hartree
zpe.sumelectthermalfe: -960.157727 hartree
dipole: -2.0002 -2.6557 -1.2665
dipole: 3.5578
quadrupole: -107.2967 -119.0245 -134.0642
quadrupole: 10.9323 -4.8201 0.2249
quadrupole: 12.8318 1.1040 -13.9357 10.9323 -4.8201 0.2249
hfenergy: -960.4445541 hartree
pointgroup: C01 [X(C19H20O3)]
dipole: 0.917594 -1.0552753 0.0607927 debye
polarizability: 245.0670545|2.4624538|221.6587966|-23.659946|32.6044318|156.7244641 unknown
InChI: InChI=1S/C19H20O3/c1-2-16(13-15-9-5-3-6-10-15)19(21)22-14-18(20)17-11-7-4-8-12-17/h3-12,16H,2,13-14H2,1H3
charge 0 multiplicity 1
42 atoms
O  -0.291886 0.125436 0.781703
O  -0.660732 1.2683 -1.215876
O  1.8475 1.835649 0.958118
C  -2.326858 1.423439 0.607339
C  -3.538083 1.094119 -0.32385
C  -2.257529 2.951771 0.904046
C  -3.723937 -0.393834 -0.585319
C  -1.037103 0.970151 -0.060013
C  -1.202507 3.331815 1.964366
C  -3.225821 -0.993807 -1.771069
C  -4.382927 -1.217848 0.364271
C  0.992595 -0.33486 0.243937
C  -3.381079 -2.380112 -2.001052
C  -4.539338 -2.603598 0.139038
C  -4.037897 -3.190548 -1.04653
C  2.109919 0.699794 0.477513
C  3.507922 0.301639 0.10968
C  3.818058 -0.957401 -0.474107
C  4.556576 1.229565 0.357751
C  5.152346 -1.280109 -0.800264
C  5.887598 0.905256 0.032706
C  6.188887 -0.351503 -0.546913
H  -2.42911 0.872243 1.559909
H  -4.441789 1.510546 0.161283
H  -3.3917 1.636808 -1.276129
H  -3.263695 3.271237 1.242314
H  -2.053258 3.484278 -0.04545
H  -0.186713 3.029589 1.654928
H  -1.200339 4.424189 2.134288
H  -1.418531 2.839721 2.931592
H  -2.715346 -0.368725 -2.513557
H  -4.781733 -0.767944 1.282694
H  1.208402 -1.275171 0.777725
H  0.896985 -0.530008 -0.842161
H  -2.995515 -2.825424 -2.925557
H  -5.055337 -3.223436 0.881375
H  -4.163103 -4.264464 -1.225898
H  3.029112 -1.688187 -0.682373
H  4.296202 2.194977 0.804342
H  5.385245 -2.250413 -1.251789
H  6.689925 1.624947 0.227396
H  7.22429 -0.604677 -0.800708
