program: Gaussian 09
title: 000271876
version: EM64L-G09RevD.01
frameworkgroup: C1[X(C14H13ClO)]
method: RPBEPBE
basis: SDD
operation: Freq
keyword: #p
keyword: freq=noraman
keyword: PBEPBE/SDD
title: #p freq=noraman PBEPBE/SDD
converged: YES YES NO NO
title: Mulliken charges:
elementType: Cl O C C C C C C C C C C C C C C H H H H H H H H H H H H H
charge: -0.071511 -0.457821 -0.709131 0.388190 0.510877 -0.509017 0.127971 0.465310 -0.380564 -0.415200 -0.430484 -0.362652 -0.816840 -0.207682 -0.213046 -0.106124 0.212553 0.251122 0.233577 0.215674 0.231755 0.230306 0.270770 0.228378 0.232252 0.222576 0.251555 0.250376 0.356829
chargesum: 0.00000
title: Mulliken charges with hydrogens summed into heavy atoms:
elementType: Cl O C C C C C C C C C C C C C C
charge: -0.071511 -0.100992 -0.245456 0.388190 0.510877 -0.275440 0.127971 0.465310 -0.164890 -0.183444 -0.200178 -0.091882 -0.133634 0.043873 0.037330 -0.106124
polarizability: 2.03556490e+02 4.14213779e+00 1.56209145e+02 -3.13307194e+00 -1.72084257e+01 1.19367686e+02
1716.lowfreq: -17.4001 -2.2502 -0.0026 -0.0006 0.0009 9.9144 15.5114 19.4038 27.1418
frequency: 5.1451 19.2277 27.0352 50.1945 106.7077 135.4756 177.3365 196.9032 261.7044 286.6391 310.6466 333.9069 346.8234 365.5012 382.4381 408.7228 428.6222 453.7808 474.1845 491.0211 547.3081 600.8982 627.4287 638.5878 703.3102 711.3447 733.2434 764.8219 794.9501 797.8779 829.0567 842.3580 898.1778 916.7314 931.6839 934.0079 954.3591 972.1162 999.9931 1004.5643 1048.1441 1070.6529 1079.4056 1103.2253 1156.2186 1158.3946 1179.0396 1184.8091 1202.9743 1233.3388 1257.4693 1294.3180 1304.9123 1308.8787 1376.2749 1383.8260 1396.0971 1399.2546 1419.6644 1465.3478 1470.0677 1476.4372 1477.8326 1502.1315 1587.6535 1597.7916 1610.2187 1620.9851 2975.1520 3002.4365 3052.2980 3060.3787 3082.1112 3108.2338 3111.7014 3125.8220 3140.5413 3144.7930 3165.9642 3169.8776 3584.6933
redmass: 1.0653 3.5893 5.3272 5.7225 6.8664 4.4220 6.1285 5.1129 3.4289 4.8425 3.9327 1.8942 1.7657 2.5558 4.9449 2.9042 3.7356 3.4692 4.2256 3.2107 3.5897 5.2250 6.7600 4.3651 4.6426 3.9571 4.3972 3.6155 2.3181 1.6602 1.3256 1.7279 1.4076 2.3391 1.5741 1.6488 1.5069 1.3596 4.4623 1.5745 1.5336 2.6871 2.2367 1.3992 1.1852 1.5677 1.1567 1.1474 2.8580 2.0495 3.5356 1.3321 1.4445 1.3616 7.4880 4.4909 2.5485 1.3427 3.4055 1.2121 1.0459 1.8674 1.2274 2.5264 7.4533 6.2343 6.3715 6.6402 1.0372 1.0597 1.0978 1.1022 1.0985 1.0882 1.0912 1.0898 1.0960 1.0893 1.0952 1.0967 1.0660
irintensity: 0.3519 0.0142 0.2311 0.0582 0.9842 0.0621 2.0517 5.2262 0.1758 1.8119 1.6161 30.0945 103.9330 3.3666 3.8540 0.1023 6.5156 11.7748 12.2050 13.6082 12.6235 8.5302 0.3032 15.3994 2.3416 3.9254 19.6135 6.9342 5.9479 69.5265 2.9806 36.2143 5.2588 11.1524 0.3016 0.9270 0.5940 0.6412 42.8245 1.9898 11.8490 32.3913 87.1025 55.5842 38.9693 19.2774 6.0338 6.1427 1.3654 10.0423 34.8044 0.9430 4.4907 14.7642 0.0303 4.5408 4.6152 14.9858 9.1596 34.8333 12.0963 70.6862 36.7469 62.1569 1.3196 2.5217 0.9186 3.6455 41.4563 25.6814 21.9241 4.9783 19.8826 20.1921 11.2605 13.8155 20.2684 0.4531 7.9847 1.6041 30.5881
temp: 298.150 k
press: 1.00000 atm
elementType: 17 8 6 6 6 6 6 6 6 6 6 6 6 6 6 6 1 1 1 1 1 1 1 1 1 1 1 1 1
symmnumber: 1
zpe: 595466.4 jmol-1
zpe.correction: 0.226801 hartree
zpe.thermalcorrener: 0.241829 hartree
zpe.thermalcorrenthalpy: 0.242773 hartree
zpe.thermalcorrgfe: 0.180182 hartree
zpe.sumelectzpe: -1075.441270 hartree
zpe.sumelectthermal: -1075.426242 hartree
zpe.sumelectthermalent: -1075.425298 hartree
zpe.sumelectthermalfe: -1075.487889 hartree
dipole: 3.8653 0.5854 0.0375
dipole: 3.9096
quadrupole: -105.9112 -88.2779 -98.7017
quadrupole: 2.9997 -7.3466 -8.4162
quadrupole: -8.2810 9.3524 -1.0714 2.9997 -7.3466 -8.4162
hfenergy: -1075.6680713 hartree
pointgroup: C01 [X(C14H13Cl1O1)]
dipole: 1.5016385 -0.3190762 -0.0956834 debye
polarizability: 202.8910336|-7.671951|158.5475115|-1.9123808|-15.0368814|117.6947766 unknown
InChI: InChI=1S/C14H13ClO/c1-10-2-7-14(16)12(8-10)9-11-3-5-13(15)6-4-11/h2-8,16H,9H2,1H3
charge 0 multiplicity 1
29 atoms
Cl -5.221602 0.778204 1.315353
O  1.201513 -2.661606 -0.254169
C  0.100715 -0.404045 -1.600533
C  1.323134 -0.287317 -0.69189
C  -1.219185 -0.111592 -0.883694
C  1.958188 0.955546 -0.47217
C  1.857296 -1.426173 -0.032996
C  3.091435 1.100835 0.369237
C  2.988235 -1.318492 0.805201
C  3.598492 -0.059739 1.002076
C  -1.989897 1.030272 -1.214631
C  -1.697514 -0.97984 0.133114
C  3.73659 2.460303 0.580242
C  -3.208321 1.312466 -0.552576
C  -2.910994 -0.716962 0.805049
C  -3.647661 0.430098 0.450232
H  0.215376 0.297905 -2.446852
H  0.068639 -1.426306 -2.018731
H  1.550457 1.842327 -0.975502
H  3.393406 -2.208328 1.305366
H  4.475567 0.016656 1.65514
H  -1.641874 1.71178 -2.000165
H  -1.113602 -1.868919 0.394735
H  4.060884 2.908813 -0.377721
H  3.032335 3.172869 1.050001
H  4.623314 2.388214 1.233342
H  -3.799078 2.195368 -0.813759
H  -3.277007 -1.389791 1.586227
H  1.697162 -3.399143 0.179876
