program: Gaussian 09
title: 000271874
version: EM64L-G09RevD.01
frameworkgroup: C1[X(C11H12N2O7)]
method: RPBEPBE
basis: SDD
operation: Freq
keyword: #p
keyword: freq=noraman
keyword: PBEPBE/SDD
title: #p freq=noraman PBEPBE/SDD
converged: YES YES NO NO
title: Mulliken charges:
elementType: O O O O O O O N N C C C C C C C C C C C H H H H H H H H H H H H
charge: -0.281869 -0.450926 -0.229670 -0.186182 -0.180269 -0.181335 -0.182292 0.021259 0.023340 -0.389623 -0.354735 -0.263469 -0.331478 0.290684 0.202180 -0.485351 -0.470836 0.437729 0.431425 -0.488261 0.213417 0.213750 0.218014 0.217903 0.238164 0.238374 0.190522 0.190607 0.331181 0.329903 0.341051 0.346792
chargesum: 0.00000
title: Mulliken charges with hydrogens summed into heavy atoms:
elementType: O O O O O O O N N C C C C C C C C C C C
charge: -0.281869 -0.104134 -0.229670 -0.186182 -0.180269 -0.181335 -0.182292 0.021259 0.023340 0.037545 0.081182 0.213069 0.049650 0.290684 0.202180 -0.154170 -0.140933 0.437729 0.431425 -0.147210
polarizability: 2.39780678e+02 2.92530095e+00 1.89672334e+02 7.38432478e-01 -6.98203196e-02 7.80309099e+01
1716.lowfreq: -32.5305 -4.5739 0.0003 0.0004 0.0007 3.0559 6.6570 26.0249 32.7306
frequency: -29.9264 25.7109 32.7206 46.5434 49.8350 51.9811 79.5620 92.5106 102.6520 120.3570 135.9708 162.6809 177.7671 196.6652 212.3660 223.7522 281.0437 295.8634 316.9494 340.9540 353.7500 394.1641 461.1067 466.0855 475.6469 503.3213 513.4464 590.6045 637.2391 683.5566 690.4914 698.5557 724.8051 743.6357 755.6874 761.4284 807.5475 856.3298 869.5462 922.7362 925.2577 973.2817 975.0887 980.2082 987.4869 993.5973 1010.9068 1059.5592 1069.1467 1092.8801 1096.5981 1119.9147 1134.0716 1169.8132 1206.5446 1208.8388 1212.1196 1233.5892 1244.1292 1257.4981 1275.8232 1280.9064 1287.7879 1342.1607 1375.7917 1380.6875 1384.7454 1405.4022 1414.0199 1436.0576 1462.0234 1468.6572 1471.0938 1480.6103 1491.5954 1587.3865 1617.5106 1627.4502 2929.0737 2976.5182 2988.5501 2996.7964 3008.5416 3036.3174 3061.1985 3084.0844 3178.8559 3191.1108 3198.8859 3570.6298
redmass: 2.1639 4.4771 7.5766 7.4909 15.1355 11.4871 3.3506 3.3236 5.8465 3.1993 11.8424 4.0498 8.3074 4.9469 5.9391 4.3643 1.0784 7.8510 10.1684 8.5925 10.5366 4.5796 4.9177 5.6716 5.5135 9.1315 5.9268 4.8383 6.3882 12.2645 10.2282 2.8643 9.1395 6.0377 12.5914 1.0767 1.1388 9.8738 11.2275 8.3723 1.2101 1.4441 7.5369 1.5887 6.2785 1.4036 2.7400 2.8944 1.4569 1.6286 2.4742 6.2198 1.5337 1.1724 12.4830 10.2791 1.2678 1.2279 1.2625 4.1808 1.3982 1.0794 1.1372 1.3873 1.6967 9.2052 8.2425 5.6155 1.4616 5.6516 3.9283 1.1040 1.0725 1.0865 1.0943 8.3288 8.2202 11.1147 1.0544 1.1066 1.0599 1.0587 1.0566 1.1020 1.1057 1.1083 1.0927 1.0928 1.0929 1.0665
irintensity: 2.5951 3.2111 0.4613 0.6024 0.0001 0.0034 2.5996 0.2196 0.2545 12.8539 2.7585 4.6189 5.2167 0.0007 9.5962 1.1810 166.5799 3.1003 0.2931 0.4597 2.4989 5.9826 29.8970 0.0058 0.1611 4.4761 12.3503 1.0030 1.9538 42.9059 20.9589 41.9620 0.0025 11.4436 11.1257 5.5736 0.4577 0.5541 18.5116 66.6308 0.9507 16.5928 44.1651 25.3836 1.6076 5.3632 90.8257 3.0847 117.7222 5.4165 24.7354 292.6972 0.1531 2.2745 245.0021 363.6983 14.5108 0.0908 0.3854 86.3131 80.2669 0.0838 2.9178 0.6529 17.4546 36.9721 135.7196 10.8275 5.1689 19.2921 30.2968 2.6276 0.6885 2.8344 13.1737 6.0407 15.5229 165.0452 63.2956 51.2698 0.7773 27.7315 33.5336 0.2079 24.1845 66.0146 15.7678 25.9778 10.1320 3.0788
temp: 298.150 k
press: 1.00000 atm
elementType: 8 8 8 8 8 8 8 7 7 6 6 6 6 6 6 6 6 6 6 6 1 1 1 1 1 1 1 1 1 1 1 1
symmnumber: 1
zpe: 603015.8 jmol-1
zpe.correction: 0.229677 hartree
zpe.thermalcorrener: 0.248698 hartree
zpe.thermalcorrenthalpy: 0.249642 hartree
zpe.thermalcorrgfe: 0.179100 hartree
zpe.sumelectzpe: -1060.774728 hartree
zpe.sumelectthermal: -1060.755706 hartree
zpe.sumelectthermalent: -1060.754762 hartree
zpe.sumelectthermalfe: -1060.825304 hartree
dipole: 5.3908 1.5507 -0.0046
dipole: 5.6094
quadrupole: -127.3235 -141.2785 -111.8572
quadrupole: 11.9418 -0.3502 -0.1075
quadrupole: -0.5038 -14.4587 14.9625 11.9418 -0.3502 -0.1075
hfenergy: -1061.0044044 hartree
pointgroup: C01 [X(C11H12N2O7)]
dipole: -2.1137108 -0.6244566 -0.1130434 debye
polarizability: 239.6879588|3.2103248|188.1340038|2.4260375|13.309271|79.6619594 unknown
InChI: InChI=1S/C11H12N2O7/c14-3-1-2-4-20-11(15)8-5-9(12(16)17)7-10(6-8)13(18)19/h5-7,14H,1-4H2
charge 0 multiplicity 1
32 atoms
O  -1.774125 0.412064 0.008151
O  -7.944717 -0.13134 -0.220469
O  -0.854694 2.540272 0.279898
O  0.988874 -3.534494 -0.425802
O  4.124318 2.853454 0.360852
O  3.265658 -3.379141 -0.388227
O  5.401141 0.973848 0.143095
N  2.086101 -2.864809 -0.337132
N  4.268026 1.583074 0.208788
C  -4.139643 -0.14473 -0.121376
C  -5.596885 0.372296 -0.085897
C  -3.150316 1.004465 0.059663
C  -6.614531 -0.757487 -0.269395
C  0.606424 0.602357 0.061153
C  -0.718967 1.3030 0.130657
C  1.776546 1.390379 0.165294
C  0.702495 -0.798863 -0.103854
C  1.981171 -1.38649 -0.162612
C  3.030585 0.755037 0.100498
C  3.167705 -0.636214 -0.063952
H  -3.936923 -0.650483 -1.085081
H  -3.979306 -0.892505 0.679098
H  -5.804844 0.876642 0.877393
H  -5.760385 1.121362 -0.884562
H  -3.267604 1.515239 1.032865
H  -3.22825 1.761151 -0.742297
H  -6.448964 -1.265206 -1.245016
H  -6.499185 -1.51098 0.540574
H  1.701626 2.474385 0.293119
H  -0.194234 -1.417087 -0.184527
H  4.150686 -1.111449 -0.113015
H  -8.643683 -0.823446 -0.332784
