program: Gaussian 09
title: 000271890
version: EM64L-G09RevD.01
frameworkgroup: C1[X(C14H16N6S)]
method: RPBEPBE
basis: SDD
operation: Freq
keyword: #p
keyword: freq=noraman
keyword: PBEPBE/SDD
title: #p freq=noraman PBEPBE/SDD
converged: YES YES NO NO
title: Mulliken charges:
elementType: S N N N N N N C C C C C C C C C C C C C C H H H H H H H H H H H H H H H H
charge: 0.222405 -0.139743 -0.146946 -0.625179 -0.639800 -0.631143 -0.641943 -0.232726 -0.236775 -0.162260 -0.266685 -0.255351 -0.162448 0.221022 0.248999 -0.383143 -0.396326 -0.365574 -0.371906 0.188252 0.186970 0.256392 0.248773 0.246142 0.256605 0.253634 0.257215 0.247566 0.245953 0.331321 0.298032 0.308648 0.348199 0.331078 0.301784 0.308722 0.350234
chargesum: 0.00000
title: Mulliken charges with hydrogens summed into heavy atoms:
elementType: S N N N N N N C C C C C C C C C C C C C C
charge: 0.222405 -0.139743 -0.146946 0.004174 0.017047 0.001718 0.017013 -0.232726 -0.236775 0.094132 -0.017912 -0.009209 0.094157 0.221022 0.248999 -0.129509 -0.139111 -0.118008 -0.125952 0.188252 0.186970
polarizability: 3.92332100e+02 -2.28493493e-01 2.24269317e+02 1.63058387e+01 1.57352882e+00 1.26922066e+02
1716.lowfreq: -14.7419 -10.8182 -5.4515 -4.4163 -0.0012 -0.0008 0.0017 13.3140 21.0940
frequency: -11.7296 12.4452 20.9125 50.8276 56.2891 69.3309 74.6698 96.7073 107.1617 159.2909 173.8704 221.3497 238.3659 285.8385 289.6590 305.0284 315.5561 320.1886 381.0617 396.5199 399.2973 407.0734 411.8340 422.1601 431.8857 448.1432 454.4467 483.5488 501.5716 508.5617 521.5886 538.6422 548.0063 551.2589 555.4001 624.7717 626.0250 637.6177 656.7581 675.2646 680.8955 716.7077 721.0160 779.9567 781.9778 827.8702 831.2017 836.8986 838.8978 942.7326 943.0415 945.4023 948.2324 961.8671 964.2677 991.4177 995.0633 1026.6515 1033.0911 1061.6782 1075.4340 1086.7328 1089.9467 1100.7709 1102.9013 1176.6544 1178.6690 1284.1782 1286.0500 1290.2503 1296.0124 1328.9452 1339.8159 1402.7365 1405.5389 1429.6894 1432.8536 1471.5956 1475.3373 1545.6999 1552.6524 1594.5183 1595.8361 1602.6446 1603.3355 1610.9758 1613.4720 1662.5299 1669.9000 3118.1597 3124.3607 3136.0510 3137.7770 3146.1010 3149.0322 3161.9153 3162.8600 3520.8434 3535.1952 3543.6166 3544.9537 3662.6585 3683.7416 3686.0282 3695.4542
redmass: 4.4406 4.4543 5.3860 5.0159 4.6465 4.4249 4.2382 5.1041 5.2351 5.8747 5.6869 5.8503 5.7281 1.2682 3.0674 1.5942 4.5254 4.0513 3.5737 2.1019 2.2362 2.7752 2.4705 1.7946 1.8871 2.6286 2.6722 1.5575 1.9261 1.5769 2.5189 2.9327 2.4657 1.1773 1.3206 6.5810 6.7254 4.7827 5.7515 7.0261 7.3838 3.7802 3.9934 5.1908 5.1036 1.2648 1.2594 1.6384 1.6899 2.8803 1.5434 4.2497 1.3167 1.3585 1.3584 3.9708 3.5778 1.4082 1.4058 3.0377 3.1158 1.7866 1.7827 1.3855 1.3581 1.1176 1.1184 1.2796 1.3526 2.8295 3.1811 4.5797 4.6679 4.1335 4.1825 3.8937 3.9454 2.4975 2.5481 7.1382 7.3094 3.3005 2.9676 1.6278 1.5218 1.3664 1.4018 3.0357 3.3885 1.0877 1.0873 1.0883 1.0878 1.0956 1.0960 1.0969 1.0965 1.0450 1.0449 1.0450 1.0450 1.1032 1.1040 1.1032 1.1036
irintensity: 1.4323 3.4688 2.0256 3.5710 0.2093 1.3410 1.9344 4.8791 3.9675 1.0724 9.2432 0.6572 34.8958 108.8752 21.7752 124.3144 13.0251 4.1568 3.3563 62.0626 131.4946 8.6915 57.1871 103.7478 85.5341 8.4088 59.1267 77.7362 6.2682 95.7189 70.9082 4.5570 90.8831 157.5013 257.1657 7.0239 4.8373 33.9721 14.9325 59.0400 35.0990 1.1232 1.9434 7.7727 7.3418 1.3782 6.6284 68.9240 43.3143 44.2279 7.1995 31.9084 0.1718 1.3838 1.4926 25.5663 0.8985 3.6196 7.3456 10.1127 1.3280 39.3994 9.1198 17.6208 6.9018 28.9598 1.1889 1.5714 3.1528 38.0599 36.9342 4.3212 10.4944 2.6073 9.3929 180.6017 230.2247 153.4380 32.0533 0.9082 14.2370 208.8729 143.0732 123.2790 81.8298 134.1213 174.1710 1486.7460 776.9539 14.7367 11.2829 7.9875 6.5866 12.6260 10.7586 6.7385 13.1551 19.2412 52.1975 13.1915 59.1957 41.5977 36.4133 28.6788 27.7735
temp: 298.150 k
press: 1.00000 atm
elementType: 16 7 7 7 7 7 7 6 6 6 6 6 6 6 6 6 6 6 6 6 6 1 1 1 1 1 1 1 1 1 1 1 1 1 1 1 1
symmnumber: 1
zpe: 754378.4 jmol-1
zpe.correction: 0.287328 hartree
zpe.thermalcorrener: 0.307511 hartree
zpe.thermalcorrenthalpy: 0.308455 hartree
zpe.thermalcorrgfe: 0.236489 hartree
zpe.sumelectzpe: -1268.164001 hartree
zpe.sumelectthermal: -1268.143817 hartree
zpe.sumelectthermalent: -1268.142873 hartree
zpe.sumelectthermalfe: -1268.214839 hartree
dipole: 3.1096 5.2703 -0.5272
dipole: 6.1420
quadrupole: -62.2093 -116.5328 -133.2158
quadrupole: -19.4283 4.6872 1.1152
quadrupole: 41.7766 -12.5468 -29.2298 -19.4283 4.6872 1.1152
hfenergy: -1268.4513281 hartree
pointgroup: C01 [X(C14H16N6S1)]
dipole: -1.2291098 -1.6887295 1.2151767 debye
polarizability: 393.1672968|-5.318742|177.5520561|-3.7907088|-49.0682733|172.8041297 unknown
InChI: InChI=1S/C14H16N6S/c15-13(16)19-9-1-5-11(6-2-9)21-12-7-3-10(4-8-12)20-14(17)18/h1-8H,15-18H2
charge 0 multiplicity 1
37 atoms
S  0.034717 1.784106 -1.997892
N  5.327955 -0.279879 0.260203
N  -4.418827 -1.427328 0.690435
N  6.742764 -1.407491 1.740188
N  4.535648 -2.191733 1.522326
N  -6.601163 -2.117803 1.141809
N  -6.311669 -0.417708 -0.455582
C  1.581443 1.083384 -1.271865
C  -1.276923 0.80534 -1.145891
C  1.722894 0.867173 0.119007
C  -2.394358 1.489243 -0.616012
C  2.680088 0.84191 -2.131148
C  -1.220499 -0.608478 -1.061216
C  4.058591 0.126468 -0.213076
C  -3.423246 -0.657486 0.053255
C  2.93892 0.382431 0.641427
C  -3.461079 0.769055 -0.033171
C  3.905328 0.383259 -1.605553
C  -2.26808 -1.324979 -0.45472
C  5.49368 -1.248555 1.138245
C  -5.708244 -1.29064 0.457589
H  0.883281 1.076843 0.790719
H  -2.4239 2.584067 -0.644159
H  2.57565 1.009631 -3.208712
H  -0.35238 -1.141107 -1.464138
H  3.045467 0.248765 1.724524
H  -4.293716 1.318479 0.423799
H  4.764605 0.210377 -2.261267
H  -2.223893 -2.415656 -0.370327
H  7.443995 -0.717313 1.478335
H  7.056974 -2.324605 2.050898
H  4.63801 -2.733698 2.376614
H  3.62028 -2.157782 1.078792
H  -6.178621 -2.780798 1.788085
H  -7.564111 -1.828637 1.296418
H  -7.226533 -0.642013 -0.84227
H  -5.70725 0.199459 -0.996468
