program: Gaussian 09
title: 000271905
version: EM64L-G09RevD.01
frameworkgroup: C1[X(C22H21NO2)]
method: RPBEPBE
basis: SDD
operation: Freq
keyword: #p
keyword: freq=noraman
keyword: PBEPBE/SDD
title: #p freq=noraman PBEPBE/SDD
converged: YES YES NO NO
title: Mulliken charges:
elementType: O O N C C C C C C C C C C C C C C C C C C C C C C H H H H H H H H H H H H H H H H H H H H H
charge: -0.320208 -0.255708 -0.368269 -0.237158 0.560702 -0.691727 -0.693237 -0.457896 -0.377846 0.378444 -0.315914 -0.430104 0.402214 0.422215 0.204237 -0.364962 -0.352655 -0.342940 -0.353921 -0.221951 -0.209330 -0.222746 -0.217368 -0.250595 -0.241256 0.210097 0.209779 0.211675 0.228649 0.227849 0.212090 0.209176 0.233292 0.232204 0.299818 0.256573 0.260253 0.258065 0.279617 0.252922 0.226522 0.230527 0.227505 0.230738 0.229231 0.231397
chargesum: 0.00000
title: Mulliken charges with hydrogens summed into heavy atoms:
elementType: O O N C C C C C C C C C C C C C C C C C C C C C C
charge: -0.320208 -0.255708 -0.368269 -0.027062 0.560702 -0.041624 -0.044121 -0.224604 -0.145642 0.378444 -0.016096 -0.173530 0.402214 0.422215 0.204237 -0.104709 -0.094591 -0.063322 -0.100999 0.004571 0.021198 0.004758 0.013370 -0.021364 -0.009859
polarizability: 3.48701195e+02 1.38729816e+01 2.68332040e+02 -5.22482623e+00 -3.14245039e+00 1.61600364e+02
1716.lowfreq: -23.1253 -9.9001 -3.6467 -1.2089 -0.0005 -0.0004 -0.0003 17.0958 19.9753
frequency: -21.2457 15.5604 19.5540 35.8095 41.8206 50.9699 60.9523 68.4194 90.7670 107.9697 146.7831 177.1437 199.9006 203.8769 230.7825 235.8899 248.4277 271.2329 299.9652 317.0830 349.5966 390.4536 404.2265 404.5336 409.0070 415.1168 433.0671 452.7754 504.3291 518.9960 541.7409 545.6130 611.9929 614.4191 616.9600 625.7001 665.8884 676.0505 692.7187 698.4556 699.4776 733.8658 749.1517 763.1015 773.5692 794.4583 833.8998 835.0473 846.6563 848.7513 889.1743 908.1002 913.6716 915.3402 933.8989 952.9665 957.8856 967.5131 971.8480 973.8246 974.6225 987.0971 989.1320 989.9529 994.2662 1008.1098 1025.3774 1030.4359 1051.0929 1078.1015 1092.0676 1109.3291 1112.9785 1153.1882 1156.4933 1165.3713 1171.7478 1173.5334 1181.0946 1195.9017 1197.3252 1222.1857 1258.6754 1279.5366 1288.9482 1309.1938 1312.8907 1325.1802 1329.2183 1373.8531 1376.9153 1384.9721 1385.5690 1394.3421 1414.1839 1437.8897 1444.0705 1464.7023 1467.1340 1477.1214 1479.9024 1480.9174 1483.3865 1495.8398 1585.8897 1589.9878 1596.6195 1604.2999 1608.8206 1616.0876 1639.1531 2973.0511 2976.0432 2980.1777 3065.6414 3072.9758 3077.3833 3081.5769 3123.5517 3126.9106 3129.1960 3130.1377 3138.8216 3139.8381 3151.2164 3156.6804 3159.3569 3164.8100 3168.4647 3170.8864 3196.4574 3207.4850
redmass: 3.1558 3.8979 5.4176 3.2560 5.6559 4.1919 5.5192 4.9345 5.0545 4.9016 4.1844 4.9425 3.0915 1.0786 3.4618 2.3926 1.8148 3.6979 4.2752 3.2345 6.8226 5.6347 3.5196 3.0440 2.8613 3.4882 5.2518 3.7339 3.8010 3.6520 2.6302 3.1476 6.3236 5.9248 5.2471 7.0833 6.5358 9.7756 1.9811 4.5516 1.8854 3.5323 3.6782 1.7502 2.8376 4.4017 1.2561 1.3114 1.2669 1.4826 2.5563 1.4481 1.8187 1.1789 3.2227 1.4810 1.3420 1.5031 3.2209 1.6232 1.3981 4.3755 1.4329 6.1866 1.3136 2.9562 2.0383 2.1271 1.5295 1.5411 1.5840 1.4493 2.5634 1.7904 2.2663 2.6467 1.0531 1.0502 1.1743 1.1787 1.4734 2.1852 4.1671 4.3947 1.4995 1.3205 1.4127 1.7718 1.3835 1.1977 8.2366 8.7980 3.5792 1.2928 2.7185 2.2491 2.3488 1.0474 1.0487 1.0499 2.2171 1.5674 1.8085 1.8090 6.9744 6.3195 6.6060 6.2533 6.2218 6.5496 10.8856 1.0348 1.0352 1.0844 1.1000 1.0991 1.1005 1.0997 1.0906 1.0892 1.0850 1.0849 1.0885 1.0899 1.0929 1.0943 1.0971 1.0954 1.0992 1.1017 1.0948 1.0938
irintensity: 0.1431 0.5165 0.9885 0.0021 0.6856 0.0972 0.6284 0.4435 0.2081 0.4166 1.0092 1.0843 0.3657 0.1228 0.5569 1.1941 0.0354 3.6425 0.1078 0.2721 9.3528 2.4460 0.4870 1.2121 0.2507 0.3147 1.1644 1.7869 2.9067 16.1761 23.4499 17.8992 0.2468 8.4897 9.1767 1.8816 9.7764 8.5785 38.4395 2.4536 59.3333 2.3647 4.9046 72.2313 19.5555 8.8550 0.8358 8.5638 5.8891 49.3441 1.3451 3.4143 4.2513 3.8114 8.7563 0.0576 1.7209 16.5694 110.4120 31.8046 1.9667 1.7194 0.2459 2.7341 0.1421 49.1138 13.6045 5.4913 32.8011 11.4526 18.1436 24.3452 1.5913 52.4236 18.5170 563.5293 0.0213 1.4049 21.9585 18.9861 388.8557 114.9487 223.4505 411.5392 0.2465 0.8498 62.4192 2.5318 14.0107 15.3806 4.4160 1.4121 26.8569 5.2925 12.5775 8.5985 9.5516 5.6423 0.4697 15.1323 47.1170 113.3493 54.7229 134.2243 3.0799 8.8109 4.1423 64.3472 64.6926 9.6076 242.9238 31.7800 40.7518 17.8611 1.3969 112.3454 24.3262 42.2096 19.9567 21.8145 0.8031 0.6221 4.6337 14.9950 25.2543 29.5177 21.4179 4.7783 17.7532 11.9519 1.3119 2.4060
temp: 298.150 k
press: 1.00000 atm
elementType: 8 8 7 6 6 6 6 6 6 6 6 6 6 6 6 6 6 6 6 6 6 6 6 6 6 1 1 1 1 1 1 1 1 1 1 1 1 1 1 1 1 1 1 1 1 1
symmnumber: 1
zpe: 969047.7 jmol-1
zpe.correction: 0.369091 hartree
zpe.thermalcorrener: 0.390929 hartree
zpe.thermalcorrenthalpy: 0.391873 hartree
zpe.thermalcorrgfe: 0.315276 hartree
zpe.sumelectzpe: -1054.383387 hartree
zpe.sumelectthermal: -1054.361549 hartree
zpe.sumelectthermalent: -1054.360604 hartree
zpe.sumelectthermalfe: -1054.437202 hartree
dipole: -0.0885 2.6273 0.2421
dipole: 2.6399
quadrupole: -126.0233 -136.0940 -145.1613
quadrupole: -3.1652 -2.0062 -1.8421
quadrupole: 9.7362 -0.3344 -9.4017 -3.1652 -2.0062 -1.8421
hfenergy: -1054.7524776 hartree
pointgroup: C01 [X(C22H21N1O2)]
dipole: 0.128541 0.9032072 -0.4963939 debye
polarizability: 345.5686681|-20.9085501|256.5885288|4.3368381|-37.7975025|176.4764021 unknown
InChI: InChI=1S/C22H21NO2/c1-17(2)18-13-15-21(16-14-18)25-22(24)23(19-9-5-3-6-10-19)20-11-7-4-8-12-20/h3-17H,1-2H3
charge 0 multiplicity 1
46 atoms
O  -0.447845 -0.069068 -0.091563
O  0.204451 -2.02204 1.070698
N  1.778335 -0.485003 0.194429
C  -6.234078 -0.211392 0.130091
C  -4.703554 -0.203948 0.095935
C  -6.831334 -0.604374 -1.248176
C  -6.804767 1.149952 0.609208
C  -3.951134 -1.096892 0.89592
C  -3.989658 0.693945 -0.742857
C  -1.863587 -0.213748 0.031133
C  -2.53649 -1.119509 0.880245
C  -2.582753 0.694235 -0.779017
C  2.954002 -1.258212 0.542675
C  1.979957 0.819585 -0.422789
C  0.488915 -0.964742 0.460018
C  4.149827 -0.56842 0.873173
C  2.546681 0.889839 -1.715757
C  2.946241 -2.677412 0.529089
C  1.658039 2.002133 0.281468
C  5.321263 -1.289857 1.184798
C  2.785572 2.149326 -2.308469
C  4.124069 -3.386232 0.847932
C  1.890981 3.258949 -0.318818
C  5.317636 -2.703167 1.175331
C  2.457224 3.336789 -1.613176
H  -6.547292 -0.982536 0.862816
H  -6.561349 0.13733 -2.023141
H  -7.93513 -0.651155 -1.195586
H  -6.456887 -1.589578 -1.579558
H  -6.413023 1.418115 1.606806
H  -7.908466 1.110143 0.667391
H  -6.533238 1.962627 -0.090208
H  -4.477849 -1.801026 1.551946
H  -4.535249 1.402991 -1.37667
H  -1.977952 -1.825846 1.494708
H  -2.025781 1.383502 -1.420953
H  4.162866 0.525412 0.887007
H  2.795363 -0.035932 -2.24489
H  2.02884 -3.218637 0.292692
H  1.220243 1.933027 1.28261
H  6.235641 -0.742748 1.439885
H  3.221499 2.202487 -3.312053
H  4.105152 -4.481693 0.835619
H  1.636099 4.174925 0.225336
H  6.227491 -3.261763 1.419634
H  2.641029 4.313116 -2.074811
