program: Gaussian 09
title: 000271877
version: EM64L-G09RevD.01
frameworkgroup: C1[X(C13H22N2O2)]
method: RPBEPBE
basis: SDD
operation: Freq
keyword: #p
keyword: freq=noraman
keyword: PBEPBE/SDD
title: #p freq=noraman PBEPBE/SDD
converged: YES YES NO NO
title: Mulliken charges:
elementType: O O N N C C C C C C C C C C C C C H H H H H H H H H H H H H H H H H H H H H H
charge: -0.249590 -0.207805 -0.202905 -0.415670 0.036907 -0.027759 -0.030265 -0.516924 -0.483828 -0.442828 -0.048185 -0.743864 -0.472943 -0.735763 -0.739376 0.235455 0.154176 0.201457 0.245419 0.194926 0.227851 0.193067 0.215504 0.191672 0.199952 0.198957 0.195967 0.219720 0.217100 0.222399 0.260788 0.263283 0.210265 0.212184 0.224530 0.209073 0.211996 0.225503 0.349555
chargesum: 0.00000
title: Mulliken charges with hydrogens summed into heavy atoms:
elementType: O O N N C C C C C C C C C C C C C
charge: -0.249590 -0.207805 -0.202905 -0.066115 0.238364 0.217660 0.164661 -0.096006 -0.076652 -0.043920 0.147782 -0.084645 0.051128 -0.088785 -0.092804 0.235455 0.154176
polarizability: 1.82314301e+02 -6.09833531e+00 1.39500395e+02 -2.58852639e+00 1.47654676e+00 1.43030169e+02
1716.lowfreq: -13.1425 -3.1243 0.0004 0.0006 0.0011 6.9174 23.7877 37.2816 45.2901
frequency: 21.7859 37.2312 45.1994 73.9506 79.9375 140.8006 164.2151 172.9098 185.2223 190.1071 196.7762 207.7095 223.9306 233.0523 294.7240 309.0287 350.6715 365.7337 373.7085 398.3587 419.7943 435.3421 465.4840 511.3494 538.8030 547.3983 569.2565 627.3738 655.1611 669.1138 712.5183 770.6088 804.0339 824.2048 860.9318 867.8911 878.3961 911.8259 914.9868 934.1748 941.4425 953.9721 983.7579 991.6937 1028.5468 1031.4696 1067.6614 1075.1344 1099.7847 1106.2124 1110.2925 1148.0207 1150.1688 1161.8711 1169.4865 1180.0286 1188.2242 1224.5471 1237.2721 1238.6344 1269.4001 1274.5902 1289.0377 1298.1159 1300.6144 1306.4970 1311.2347 1325.0418 1329.5656 1331.5270 1344.1586 1348.9423 1361.1478 1379.3427 1389.6455 1393.8764 1396.4867 1456.4093 1458.7060 1465.0440 1467.3136 1468.2129 1472.8971 1476.7387 1480.0452 1482.3847 1494.7565 1681.5502 1706.9181 2927.8221 2935.8443 2945.7671 2951.7766 2961.6618 2963.9998 2970.5076 2973.9727 2974.9949 2991.6412 3000.3988 3026.5548 3041.7393 3042.5008 3049.6984 3059.6784 3066.9420 3069.3443 3072.7774 3076.4206 3081.2817 3593.0667
redmass: 5.3418 2.6399 5.1286 2.8987 3.2826 3.1350 2.7407 3.0136 2.2658 1.4444 1.5960 1.6971 1.6201 1.9779 2.7854 3.0454 2.6766 2.3327 3.0178 4.2295 2.4476 3.0021 2.6645 2.3541 2.2226 3.0178 4.7555 4.8911 1.3399 6.4508 7.9485 2.0050 3.2091 1.9230 2.0421 2.1010 3.6650 1.5585 1.2632 1.9383 1.5035 1.4011 1.6480 1.9628 2.0851 2.2890 1.3503 2.8269 2.4987 2.2458 2.1539 2.6241 2.1784 1.2089 1.8024 1.9990 2.7531 2.1018 1.6318 1.2785 1.3215 4.5377 1.3797 1.2833 1.2552 1.6906 1.4245 1.3706 1.3953 1.4623 1.6452 1.7483 1.6012 1.2133 1.2980 1.7278 1.2491 1.0943 1.0980 1.0809 1.0678 1.0785 1.0499 1.0461 1.0627 1.0584 1.0474 7.7786 12.5975 1.0795 1.0814 1.0798 1.0675 1.0695 1.0635 1.0366 1.0370 1.0363 1.0584 1.0828 1.0986 1.1035 1.0963 1.0960 1.0989 1.0981 1.0991 1.0993 1.0985 1.0979 1.0803
irintensity: 0.7650 0.0934 0.2404 0.0417 0.2586 3.1163 5.2508 1.1329 1.4412 0.5025 0.0498 1.8283 0.0554 1.8011 2.2102 3.9478 2.0902 1.5930 7.5832 7.5179 0.8937 2.0361 0.5703 2.7490 10.1895 0.9204 8.1910 24.0648 96.4733 8.5748 46.5488 1.0497 4.5007 1.0227 2.7506 3.8519 11.0525 6.9135 9.7948 9.0181 7.7102 0.7810 5.2711 0.1606 15.2996 10.4969 10.0636 47.6455 3.9036 2.1681 0.4657 15.0687 10.1399 3.6507 7.9367 4.2129 16.7572 148.4612 3.0707 2.8622 18.5155 97.8968 2.5665 9.7536 5.1906 17.0847 5.5121 6.3724 4.4687 9.3835 13.6117 33.7234 13.0263 14.0310 35.7563 72.2488 14.5541 1.1707 36.3575 16.6144 2.0236 5.0110 14.4334 2.5023 5.7385 6.2583 24.1888 688.3323 190.9740 0.7512 12.7452 5.5924 19.5954 19.4104 82.5810 28.3924 37.9137 29.5200 20.0002 19.3122 44.5042 12.2696 34.4879 45.3588 0.9849 87.8361 45.3106 38.1631 49.7479 43.8783 72.8374
temp: 298.150 k
press: 1.00000 atm
elementType: 8 8 7 7 6 6 6 6 6 6 6 6 6 6 6 6 6 1 1 1 1 1 1 1 1 1 1 1 1 1 1 1 1 1 1 1 1 1 1
symmnumber: 1
zpe: 882906.9 jmol-1
zpe.correction: 0.336281 hartree
zpe.thermalcorrener: 0.354085 hartree
zpe.thermalcorrenthalpy: 0.355029 hartree
zpe.thermalcorrgfe: 0.289811 hartree
zpe.sumelectzpe: -767.244483 hartree
zpe.sumelectthermal: -767.226680 hartree
zpe.sumelectthermalent: -767.225736 hartree
zpe.sumelectthermalfe: -767.290954 hartree
dipole: -3.4576 1.1739 -1.3825
dipole: 3.9045
quadrupole: -114.6285 -103.1800 -114.7680
quadrupole: 3.9002 5.5323 -3.4229
quadrupole: -3.7696 7.6788 -3.9092 3.9002 5.5323 -3.4229
hfenergy: -767.5807649 hartree
pointgroup: C01 [X(C13H22N2O2)]
dipole: -1.3778671 0.3918504 -0.554649 debye
polarizability: 182.5660312|-5.0522542|139.3781091|-2.7182833|1.6696823|142.9007249 unknown
InChI: InChI=1S/C13H22N2O2/c1-8(2)10-5-4-9(3)11(6-10)15-7-12(16)14-13(15)17/h8-11,14H,4-7H2,1-3H3
charge 0 multiplicity 1
39 atoms
O  2.095321 -0.015799 2.405428
O  4.336727 -1.251527 -1.564141
N  1.415754 -0.008993 0.118865
N  3.503038 -0.716257 0.597539
C  -2.463571 -0.130443 0.166761
C  0.037794 0.496504 0.296844
C  -0.202813 1.823503 -0.475137
C  -1.001357 -0.591366 -0.078046
C  -2.705749 1.208229 -0.580204
C  -1.659027 2.2845 -0.214931
C  -3.495784 -1.233935 -0.233696
C  0.812539 2.917216 -0.084566
C  2.020328 -0.367995 -1.171314
C  -3.252392 -2.567166 0.518136
C  -4.957018 -0.774688 0.002905
C  2.288527 -0.214139 1.180207
C  3.438893 -0.842848 -0.790961
H  -2.584849 0.058047 1.258056
H  -0.048149 0.7094 1.382055
H  -0.107336 1.612618 -1.564077
H  -0.775017 -1.498283 0.510845
H  -0.89169 -0.858329 -1.151639
H  -3.714139 1.597514 -0.350037
H  -2.677626 1.018618 -1.674903
H  -1.855918 3.212546 -0.786641
H  -1.761098 2.547976 0.859123
H  -3.369875 -1.425848 -1.322632
H  1.853773 2.605825 -0.285367
H  0.621939 3.849104 -0.648244
H  0.739548 3.151943 0.99434
H  2.089271 0.490743 -1.865613
H  1.480858 -1.184656 -1.686632
H  -3.288085 -2.411408 1.614104
H  -4.034116 -3.305017 0.259096
H  -2.276841 -3.020982 0.271003
H  -5.110756 -0.487035 1.06151
H  -5.661411 -1.59569 -0.226127
H  -5.237027 0.086505 -0.62831
H  4.316333 -0.949684 1.167101
