program: Gaussian 09
title: 000271875
version: EM64L-G09RevD.01
frameworkgroup: C1[X(C14H10N2O4)]
method: RPBEPBE
basis: SDD
operation: Freq
keyword: #p
keyword: freq=noraman
keyword: PBEPBE/SDD
title: #p freq=noraman PBEPBE/SDD
converged: YES YES NO NO
title: Mulliken charges:
elementType: O O O O N N C C C C C C C C C C C C C C H H H H H H H H H H
charge: -0.212460 -0.243892 -0.206271 -0.199597 -0.153626 0.008046 0.381373 0.167135 -0.409269 0.083198 -0.334791 -0.356419 0.212867 -0.203056 -0.235817 0.288458 -0.348637 -0.350550 -0.227594 -0.206339 0.254510 0.244498 0.302009 0.241598 0.232946 0.231838 0.274056 0.278422 0.243002 0.244362
chargesum: 0.00000
title: Mulliken charges with hydrogens summed into heavy atoms:
elementType: O O O O N N C C C C C C C C C C C C C C
charge: -0.212460 -0.243892 -0.206271 -0.199597 -0.153626 0.008046 0.381373 0.167135 0.089739 0.083198 -0.032782 -0.114821 0.212867 0.029890 -0.003978 0.288458 -0.074581 -0.072128 0.015408 0.038023
polarizability: 2.78076924e+02 9.35777218e+00 1.86665428e+02 1.92501620e+01 -1.10481673e+01 9.73444892e+01
1716.lowfreq: -5.4998 -1.2861 -0.0005 -0.0002 0.0003 9.0418 28.9603 41.9935 55.3005
frequency: 28.9093 41.9598 55.2976 76.0791 115.0795 124.8462 150.2479 166.9703 203.5612 225.8403 243.8755 256.4226 319.3292 336.3400 380.9969 405.6356 418.8072 421.9409 453.2437 507.5740 531.7268 542.7794 584.7530 600.4207 640.1846 647.0911 675.5520 683.2735 704.4065 710.4101 759.0544 763.1572 784.7813 791.0130 823.0733 858.5835 874.9615 894.3350 898.3274 944.4179 957.8654 972.7535 987.9626 1000.3333 1011.8246 1021.4213 1036.0197 1059.6451 1086.5369 1135.6285 1137.5509 1144.2458 1170.9512 1176.2244 1195.0105 1226.0813 1241.1391 1271.1104 1278.7525 1311.4244 1368.0063 1383.5185 1388.2376 1414.8183 1429.4531 1450.0274 1464.9297 1468.9212 1477.6969 1532.7542 1579.7583 1603.8003 1607.1448 1616.1999 2975.4701 3075.1171 3136.6150 3145.9979 3147.9574 3160.4098 3167.8917 3172.7305 3184.0785 3201.2428
redmass: 7.0291 5.6134 7.3769 6.1368 5.4159 6.6593 5.9623 7.4007 3.7593 5.1113 6.5449 6.7173 6.3040 10.5817 8.4272 4.1052 4.7428 3.2153 5.5799 6.7125 4.5818 4.8736 6.2768 6.4711 6.9779 6.0527 5.5735 7.5715 4.8487 4.2952 4.1433 1.3120 1.5423 5.5808 4.5530 5.6142 1.3249 3.3164 2.0383 1.4001 6.4615 1.4223 1.3097 1.3571 1.7297 2.0841 2.7041 4.7603 2.3220 1.8756 1.5047 1.3748 1.0919 1.0681 2.7827 10.3448 2.4350 1.3984 1.6533 1.4160 10.2604 7.0118 8.5666 3.5748 2.4452 2.6161 1.2055 2.4813 3.2874 10.3026 6.5673 7.3909 7.0393 7.3901 1.0645 1.1005 1.0864 1.0867 1.0919 1.0911 1.0984 1.0958 1.0990 1.0960
irintensity: 4.3233 1.9413 1.4788 0.8105 0.1111 0.9745 2.9881 2.0438 7.3628 2.4544 5.0487 1.8260 1.0018 6.8544 6.6390 1.6387 0.5982 5.7435 1.2940 0.9525 0.9899 1.4397 5.5753 3.4606 6.8076 2.5116 58.6834 5.3695 3.6697 6.1112 17.1574 93.0626 54.6286 16.2840 9.8782 4.2308 3.2411 19.1181 24.0456 6.3357 30.1804 5.2059 0.5432 1.7475 1.3935 12.8992 2.2443 3.7574 1.9466 1.9046 5.9128 2.2473 1.8073 2.2436 2.3586 162.3527 21.4724 6.1007 2.4482 7.7677 112.4806 136.8530 42.6715 120.6133 13.2918 84.5638 33.7125 24.7629 130.8919 219.5683 3.1389 1.1513 5.0861 9.7317 31.9651 11.6522 0.1843 2.8892 15.3146 7.3211 26.4854 6.0314 10.6578 2.1680
temp: 298.150 k
press: 1.00000 atm
elementType: 8 8 8 8 7 7 6 6 6 6 6 6 6 6 6 6 6 6 6 6 1 1 1 1 1 1 1 1 1 1
symmnumber: 1
zpe: 563563.8 jmol-1
zpe.correction: 0.214650 hartree
zpe.thermalcorrener: 0.230718 hartree
zpe.thermalcorrenthalpy: 0.231662 hartree
zpe.thermalcorrgfe: 0.170034 hartree
zpe.sumelectzpe: -948.359418 hartree
zpe.sumelectthermal: -948.343350 hartree
zpe.sumelectthermalent: -948.342406 hartree
zpe.sumelectthermalfe: -948.404034 hartree
dipole: -0.4147 0.0446 -3.0169
dipole: 3.0456
quadrupole: -79.6635 -115.8561 -120.0676
quadrupole: 8.3290 2.4040 -1.3930
quadrupole: 25.5322 -10.6604 -14.8719 8.3290 2.4040 -1.3930
hfenergy: -948.5740678 hartree
pointgroup: C01 [X(C14H10N2O4)]
dipole: -0.0679629 1.114049 0.4359614 debye
polarizability: 273.3321545|-35.7939756|105.9230315|-0.4277938|-21.0564909|182.8316552 unknown
InChI: InChI=1S/C14H10N2O4/c17-14(11-6-2-4-8-13(11)16(18)19)15-12-7-3-1-5-10(12)9-20-15/h1-8H,9H2
charge 0 multiplicity 1
30 atoms
O  0.42327 0.863484 1.190595
O  0.032071 0.174579 -2.360883
O  -1.898395 -1.223997 2.496511
O  -0.667127 -1.811067 0.66875
N  0.767027 0.499666 -0.203794
N  -1.566255 -1.093622 1.255412
C  2.151057 0.228765 -0.291853
C  2.699204 0.185797 1.015057
C  1.580679 0.375997 2.019576
C  -0.246348 0.35595 -1.131567
C  2.934113 0.008163 -1.443185
C  4.065967 -0.068387 1.196907
C  -1.669941 0.545496 -0.666234
C  4.311911 -0.24893 -1.244601
C  4.877493 -0.282262 0.052342
C  -2.288656 -0.082155 0.44629
C  -2.465651 1.419947 -1.445376
C  -3.627397 0.176507 0.80542
C  -3.81262 1.678539 -1.110907
C  -4.392872 1.064238 0.022675
H  1.287365 -0.572969 2.512316
H  1.75959 1.162294 2.771579
H  2.478209 0.031516 -2.434319
H  4.500629 -0.10922 2.201334
H  4.950109 -0.42248 -2.117654
H  5.947759 -0.478014 0.174718
H  -2.006333 1.88991 -2.320346
H  -4.04832 -0.328213 1.679246
H  -4.404683 2.3588 -1.73148
H  -5.435561 1.263771 0.28897
