program: Gaussian 09
title: 000271892
version: EM64L-G09RevD.01
frameworkgroup: C1[X(C13H20O2S)]
method: RPBEPBE
basis: SDD
operation: Freq
keyword: #p
keyword: freq=noraman
keyword: PBEPBE/SDD
title: #p freq=noraman PBEPBE/SDD
converged: YES YES NO NO
title: Mulliken charges:
elementType: S O O C C C C C C C C C C C C C H H H H H H H H H H H H H H H H H H H H
charge: 0.147057 -0.271487 -0.272415 0.143456 -0.743131 -0.826040 0.500196 -0.203879 -0.235752 -0.401513 -0.361019 -0.686626 -0.671742 -0.219929 -0.219537 -0.240454 0.179783 0.274422 0.262255 0.315143 0.260583 0.226644 0.183580 0.195239 0.191982 0.233187 0.235607 0.207728 0.224324 0.234283 0.204747 0.226494 0.232260 0.224855 0.222782 0.226917
chargesum: 0.00000
title: Mulliken charges with hydrogens summed into heavy atoms:
elementType: S O O C C C C C C C C C C C C C
charge: 0.147057 -0.271487 -0.272415 0.323239 -0.206453 -0.250315 0.500196 0.206345 0.151469 -0.168325 -0.125412 -0.020291 -0.008241 0.004926 0.003244 -0.013538
polarizability: 2.37064292e+02 8.31208205e+00 1.49650882e+02 2.16874010e+00 1.43386508e+01 1.21126591e+02
1716.lowfreq: -7.5134 -0.0015 0.0010 0.0023 2.7930 7.7651 10.7888 23.4219 25.8466
frequency: 7.1673 22.9785 25.5907 43.1353 47.7925 58.0034 81.3090 91.6261 102.7173 135.3964 189.5794 216.6877 227.4570 237.6003 249.8757 252.7021 315.4061 329.4473 334.8082 402.7192 451.5868 470.0890 486.4259 536.4560 557.6156 616.6113 643.5927 701.2147 703.8688 771.8635 780.8130 807.7494 813.2255 815.4580 851.2214 851.4339 895.0143 902.1388 925.8887 937.5209 975.6457 989.7547 993.8229 1003.3947 1026.0572 1040.4595 1049.9166 1073.3303 1092.9052 1110.9961 1117.8298 1133.9680 1136.1367 1139.7881 1171.2325 1185.2512 1198.3062 1222.4788 1242.2633 1246.5459 1249.9785 1253.1836 1317.9691 1322.2943 1324.7912 1370.4695 1383.8786 1385.4238 1395.6484 1399.5824 1420.4007 1439.7122 1459.2366 1461.4988 1471.4948 1477.8133 1480.9240 1483.0653 1491.3240 1493.2110 1592.8340 1613.0487 2897.0269 2928.7206 2941.7686 2978.7283 2991.6611 2994.5290 3028.2573 3029.7772 3036.5479 3088.7245 3092.0388 3098.9221 3102.2444 3108.8573 3112.5181 3118.7056 3121.8371 3134.5316 3145.3684 3162.3344
redmass: 4.7226 3.7587 4.1768 3.5420 1.7561 2.3912 2.7719 4.2470 4.3601 4.7987 2.8155 2.6905 2.8254 2.8128 1.6360 1.3105 4.0416 2.7636 2.9885 2.8074 3.6486 3.5138 3.1778 4.4244 5.5329 6.2766 4.2973 1.8764 3.9504 1.9491 2.4569 3.7421 1.1029 1.1114 2.8795 1.2721 1.6937 1.9639 1.5703 4.3607 1.3903 5.4372 1.3600 2.4828 2.1793 3.2409 2.7703 1.5361 3.5839 1.9017 2.2037 1.4367 1.4005 1.1011 1.0521 1.1106 1.4563 2.5252 1.2060 1.2696 1.1635 1.1488 1.1888 1.2200 1.2741 1.3394 1.6808 3.0942 1.2713 1.3248 1.0926 2.1932 1.0408 1.0433 1.1154 1.0512 1.0509 2.3289 1.0779 1.0815 6.0885 6.1458 1.0832 1.0562 1.0639 1.1064 1.0360 1.0359 1.0602 1.0952 1.0584 1.0992 1.0991 1.1009 1.1010 1.1071 1.1065 1.0846 1.0879 1.0920 1.0965 1.1017
irintensity: 0.0977 0.1638 0.5648 1.3255 1.3646 0.1500 1.4532 3.5958 3.3560 0.7060 4.7004 3.2706 2.2919 0.5859 1.7919 1.9706 1.4936 1.7389 8.8691 0.0811 3.8295 2.8744 5.0595 0.6303 7.4842 0.5123 28.6505 48.9536 29.1842 27.8347 7.6234 3.0892 5.0486 7.6734 22.2327 1.8651 5.8508 20.9767 18.8216 222.4385 0.2646 0.1251 0.4970 68.7618 5.6984 109.9281 53.8666 11.4388 61.7188 8.6803 25.9135 6.6515 7.0725 1.9736 0.0313 0.9572 27.1898 1.3926 3.7966 3.2676 5.1030 0.8065 27.5265 30.8413 0.6421 3.7382 8.9856 3.4327 19.6683 16.3125 15.0485 9.3199 12.0004 10.0961 1.9257 6.5579 5.6400 15.8115 6.5350 4.8629 0.4908 3.6598 28.4736 61.9987 69.9962 52.4115 20.7306 28.1110 27.4099 23.5252 17.0339 45.2186 34.6588 35.0060 35.6189 8.2768 4.9864 6.0720 1.0140 18.7056 47.9224 24.1739
temp: 298.150 k
press: 1.00000 atm
elementType: 16 8 8 6 6 6 6 6 6 6 6 6 6 6 6 6 1 1 1 1 1 1 1 1 1 1 1 1 1 1 1 1 1 1 1 1
symmnumber: 1
zpe: 792183.6 jmol-1
zpe.correction: 0.301727 hartree
zpe.thermalcorrener: 0.320310 hartree
zpe.thermalcorrenthalpy: 0.321254 hartree
zpe.thermalcorrgfe: 0.250031 hartree
zpe.sumelectzpe: -1054.616160 hartree
zpe.sumelectthermal: -1054.597577 hartree
zpe.sumelectthermalent: -1054.596633 hartree
zpe.sumelectthermalfe: -1054.667856 hartree
dipole: -1.8025 1.3407 1.1659
dipole: 2.5310
quadrupole: -91.5418 -100.8661 -104.5432
quadrupole: 1.2047 -7.1168 5.6116
quadrupole: 7.4419 -1.8824 -5.5595 1.2047 -7.1168 5.6116
hfenergy: -1054.917887 hartree
pointgroup: C01 [X(C13H20O2S1)]
dipole: 0.7850466 -0.6027895 -0.1089965 debye
polarizability: 215.0339056|-10.0394494|128.3073272|41.0190869|15.7450015|164.5005324 unknown
InChI: InChI=1S/C13H20O2S/c1-3-14-13(15-4-2)11-16-10-12-8-6-5-7-9-12/h5-9,13H,3-4,10-11H2,1-2H3
charge 0 multiplicity 1
36 atoms
S  -0.911053 0.139567 1.589853
O  1.827457 0.211667 -0.239541
O  3.265697 0.052506 1.630188
C  1.899339 -0.213896 1.133534
C  0.887751 0.608452 1.935011
C  -1.218573 1.18253 0.00204
C  -2.350802 0.58783 -0.798484
C  2.672628 -0.58859 -1.154921
C  3.76735 -0.966054 2.573013
C  -3.66329 1.118426 -0.710609
C  -2.11966 -0.520611 -1.656096
C  2.440587 -0.062191 -2.569767
C  5.190024 -0.564437 2.960453
C  -4.720815 0.559714 -1.464722
C  -3.172433 -1.079492 -2.411667
C  -4.478323 -0.54052 -2.318368
H  1.689862 -1.308771 1.216782
H  1.034964 1.681525 1.729945
H  1.035377 0.430806 3.013329
H  -0.261577 1.152293 -0.54176
H  -1.442152 2.211182 0.329004
H  3.730033 -0.480466 -0.847654
H  2.383694 -1.659573 -1.069164
H  3.11638 -1.012773 3.472819
H  3.751749 -1.966406 2.08644
H  -3.855212 1.971396 -0.048112
H  -1.109203 -0.942515 -1.718263
H  3.057748 -0.625611 -3.293231
H  1.380403 -0.164369 -2.861651
H  2.715783 1.004593 -2.633511
H  5.619951 -1.299847 3.66483
H  5.835834 -0.514188 2.066807
H  5.192692 0.42786 3.442986
H  -5.729247 0.981729 -1.386728
H  -2.979184 -1.932881 -3.071861
H  -5.296579 -0.974283 -2.904325
