program: Gaussian 09
title: 000271866
version: EM64L-G09RevD.01
frameworkgroup: C1[X(C18H18O3)]
method: RPBEPBE
basis: SDD
operation: Freq
keyword: #pfreq=noraman
keyword: PBEPBE/SDD
title: #p freq=noraman PBEPBE/SDD
converged: YES YES NO NO
title: Mulliken charges:
elementType: O O O C C C C C C C C C C C C C C C C C C H H H H H H H H H H H H H H H H H H
charge: -0.253769 -0.206009 -0.235411 0.363610 0.304798 0.338693 -0.486642 -0.407444 -0.393765 -0.348730 -0.352855 -0.364201 0.118825 -0.424266 -0.388462 -0.389930 0.267282 -0.683978 -0.235447 -0.234576 -0.236649 0.250235 0.236891 0.207453 0.227840 0.242635 0.244642 0.239226 0.276304 0.257256 0.253630 0.239245 0.240445 0.221736 0.211015 0.207892 0.229362 0.229692 0.233426
chargesum: 0.00000
title: Mulliken charges with hydrogens summed into heavy atoms:
elementType: O O O C C C C C C C C C C C C C C C C C C
charge: -0.253769 -0.206009 -0.235411 0.363610 0.304798 0.338693 0.000485 -0.164809 -0.149123 0.086563 -0.113629 -0.087897 0.118825 0.086620 -0.149218 -0.149485 0.267282 -0.043334 -0.006085 -0.004884 -0.003224
polarizability: 3.72000057e+02 1.28639575e+01 1.78535059e+02 1.04892872e+01 4.64608524e-01 1.16684751e+02
1716.lowfreq: -3.4319 -0.0010 -0.0007 0.0010 2.5994 4.2746 15.9779 19.4773 35.2153
frequency: 15.6725 19.3021 35.2030 42.8446 51.4366 68.6223 78.5485 87.3756 99.6097 134.1797 152.7566 178.0310 217.6422 230.1896 280.7461 292.4567 308.1878 326.2337 356.9203 386.2612 403.0184 407.7361 461.3174 465.9948 493.6166 526.5583 545.6504 574.6421 613.3218 633.6703 636.1754 667.0478 700.7487 730.5580 737.3926 740.9630 772.9108 792.6269 831.7137 840.1052 850.2306 863.4145 868.2971 899.5358 923.5712 954.8190 963.4284 975.7315 987.0454 989.4291 995.8619 997.1166 1004.1281 1016.0309 1037.0391 1042.3021 1053.8074 1086.8316 1093.5097 1107.2418 1125.9666 1133.1828 1175.3438 1192.3980 1202.5759 1220.3046 1241.4975 1243.6355 1281.1889 1292.2893 1296.3154 1307.4882 1315.7068 1332.9528 1360.9029 1363.3447 1377.5884 1394.7901 1418.7654 1420.0599 1438.6148 1439.4491 1474.4111 1476.5478 1479.2180 1485.8888 1514.5972 1554.4978 1585.7904 1598.4639 1612.1625 1622.5829 1659.5164 2974.5511 2985.7588 2997.7153 3001.0430 3037.4550 3055.1217 3076.6754 3079.0641 3087.8661 3125.8370 3129.6517 3133.9625 3139.5815 3143.2049 3151.6058 3155.5952 3163.0954 3167.6419
redmass: 3.9260 3.9756 5.2902 1.9436 5.9027 4.3484 4.1514 6.7423 3.1909 4.7101 4.4250 4.0835 6.7091 1.0864 5.4102 3.3994 5.0186 5.4971 4.0152 4.1445 2.8404 2.8473 4.6395 5.2140 4.5487 3.1318 2.9546 2.3640 6.5217 6.9355 7.0517 4.8895 1.7490 3.8744 1.9115 1.7602 1.9434 5.9254 2.5592 1.8768 1.2521 1.3877 1.3661 2.1010 1.4435 4.4723 1.5191 1.4636 2.3767 3.2372 6.2636 1.3206 1.6398 2.8934 3.0216 2.0880 2.3664 1.6215 2.0510 2.4922 1.4013 2.4148 1.0534 1.1177 1.1905 1.3344 2.1247 1.2404 1.1765 2.8220 1.3916 1.3973 1.4108 1.5027 2.7054 1.7149 9.5950 1.2155 1.1314 3.8498 2.3725 1.0843 1.0530 2.1441 1.0420 1.0788 2.7738 6.4203 6.2504 8.0125 6.0972 6.8216 9.7583 1.0360 1.0637 1.0607 1.0617 1.0961 1.0991 1.0991 1.1016 1.0999 1.0848 1.0874 1.0870 1.0884 1.0914 1.0964 1.0957 1.0967 1.1016
irintensity: 0.1609 0.6365 0.8073 0.9781 0.1469 0.6044 0.1442 1.6632 2.3875 0.0609 5.4188 3.1331 3.5388 0.0169 1.2312 8.7895 23.9082 0.6088 1.2479 4.7465 0.3960 0.8433 12.5076 1.0086 9.7153 4.6186 2.0741 6.9734 0.1044 0.3554 2.7207 11.8861 46.1447 5.4625 7.8297 37.4768 68.3980 5.1727 26.8884 2.6168 0.5349 18.0801 1.9946 10.0914 2.6034 184.6601 14.1839 2.4131 4.7029 0.1364 9.3330 0.0838 2.1797 12.1529 0.8820 1.1519 12.4854 8.3507 147.0254 92.8307 13.5687 212.6715 0.0365 2.4340 69.4300 0.7790 133.3476 53.6103 15.0093 5.6671 22.3916 2.5853 1.0373 45.6992 13.5919 49.3316 0.7950 8.8731 40.6172 20.0068 9.2909 23.4808 4.3973 8.3062 12.6745 15.9753 3.9752 58.7494 33.8670 226.5498 3.4766 35.2509 142.2464 41.6047 5.2580 44.7627 25.8114 1.5154 0.6216 50.3653 75.0339 4.8407 7.9207 0.5221 14.0904 8.0794 6.1059 26.8460 24.9754 1.5251 29.7818
temp: 298.150 k
press: 1.00000 atm
elementType: 8 8 8 6 6 6 6 6 6 6 6 6 6 6 6 6 6 6 6 6 6 1 1 1 1 1 1 1 1 1 1 1 1 1 1 1 1 1 1
symmnumber: 1
zpe: 818789.0 jmol-1
zpe.correction: 0.311860 hartree
zpe.thermalcorrener: 0.331734 hartree
zpe.thermalcorrenthalpy: 0.332678 hartree
zpe.thermalcorrgfe: 0.259696 hartree
zpe.sumelectzpe: -920.888955 hartree
zpe.sumelectthermal: -920.869081 hartree
zpe.sumelectthermalent: -920.868137 hartree
zpe.sumelectthermalfe: -920.941119 hartree
dipole: -3.3809 -1.4560 1.6145
dipole: 4.0196
quadrupole: -99.1325 -115.3464 -130.4330
quadrupole: -1.3600 5.8893 -2.7685
quadrupole: 15.8381 -0.3758 -15.4623 -1.3600 5.8893 -2.7685
hfenergy: -921.2008151 hartree
pointgroup: C01 [X(C18H18O3)]
dipole: 1.3325447 0.7322902 0.434705 debye
polarizability: 371.9099959|8.9616328|172.9596802|-14.7616691|-17.7127783|122.3501906 unknown
InChI: InChI=1S/C18H18O3/c1-2-6-18(20)21-13-17(19)16-11-9-15(10-12-16)14-7-4-3-5-8-14/h3-5,7-12H,2,6,13H2,1H3
charge 0 multiplicity 1
39 atoms
O  -3.906006 0.893509 0.962127
O  -2.300207 -1.271386 0.581474
O  -4.294819 0.598162 -1.320102
C  2.63044 0.019124 0.080372
C  -0.218753 -0.061517 0.39102
C  4.110356 0.062167 -0.082493
C  -6.066836 0.060963 0.330088
C  1.866331 1.217346 0.161349
C  1.933796 -1.222043 0.158289
C  -7.130799 0.056271 -0.787078
C  0.468281 1.18089 0.313119
C  0.538812 -1.262183 0.310431
C  -1.702425 -0.160554 0.547673
C  -2.497407 1.157671 0.658723
C  4.735249 1.112718 -0.811272
C  4.937957 -0.946841 0.484737
C  -4.704925 0.524976 -0.142316
C  -8.4770 -0.51387 -0.294364
C  6.136531 1.153028 -0.967782
C  6.339578 -0.906306 0.330423
C  6.946626 0.14379 -0.39713
H  -5.931426 -0.962971 0.734766
H  -6.378875 0.685321 1.187789
H  -7.272292 1.087397 -1.16389
H  -6.753318 -0.534541 -1.6416
H  2.378249 2.185214 0.134796
H  2.491708 -2.160102 0.066048
H  -0.079314 2.127577 0.374953
H  0.000608 -2.214663 0.358357
H  -2.41006 1.718258 -0.292624
H  -2.129187 1.774556 1.494949
H  4.118821 1.883645 -1.287407
H  4.485159 -1.749737 1.077226
H  -9.229964 -0.508309 -1.103075
H  -8.364373 -1.55792 0.054036
H  -8.882022 0.079533 0.54717
H  6.595671 1.965193 -1.542181
H  6.958488 -1.688167 0.784258
H  8.034949 0.174802 -0.518059
