program: Gaussian 09
title: 000026146
version: EM64L-G09RevD.01
frameworkgroup: C1[X(C14H21NO4)]
method: RPBEPBE
basis: SDD
operation: Freq
keyword: #p
keyword: freq=noraman
keyword: PBEPBE/SDD
title: #p freq=noraman PBEPBE/SDD
converged: YES YES NO NO
title: Mulliken charges:
elementType: O O O O N C C C C C C C C C C C C C C H H H H H H H H H H H H H H H H H H H H H
charge: -0.329036 -0.459941 -0.259692 -0.275047 -0.328181 0.292180 -0.117393 -0.450417 -0.364333 -0.758274 0.245806 0.249855 -0.376185 -0.377901 -0.264812 -0.377147 -0.227565 -0.223827 -0.495668 0.271456 0.225478 0.223079 0.234749 0.238542 0.231979 0.226424 0.234181 0.264046 0.344931 0.225106 0.208402 0.245226 0.175761 0.203014 0.250333 0.228856 0.229304 0.202008 0.234181 0.200522
chargesum: 0.00000
title: Mulliken charges with hydrogens summed into heavy atoms:
elementType: O O O O N C C C C C C C C C C C C C C
charge: -0.329036 -0.115010 -0.259692 -0.275047 -0.064136 0.292180 0.154063 -0.001860 0.108959 -0.065691 0.245806 0.249855 0.057323 -0.132675 0.113964 -0.126814 0.001291 0.005477 0.141044
polarizability: 1.98904101e+02 2.85179895e+01 1.66532536e+02 -4.05597246e+00 1.44739190e+01 1.48032682e+02
1716.lowfreq: -8.1730 -2.4419 -0.0005 -0.0004 0.0004 4.1286 17.6782 23.6718 37.0675
frequency: 9.3498 23.1601 37.0555 47.2172 66.3129 84.7950 107.0331 126.7595 133.3216 156.6601 188.4489 191.0296 211.2544 218.7319 254.0441 263.2310 287.8121 289.2242 321.1778 349.0242 383.3244 429.3010 443.6198 449.9330 458.8034 472.1991 507.5487 513.5652 547.1436 561.2415 603.6763 618.1043 710.1726 712.0794 725.4610 753.9467 799.3022 825.1402 828.9158 847.4390 868.3196 884.9919 904.2207 916.8107 931.7532 953.0602 966.2304 968.3244 1012.6983 1021.1807 1034.7135 1053.8682 1069.8926 1080.3462 1093.7281 1100.0558 1112.7154 1131.4339 1138.3743 1150.8690 1160.8433 1161.6370 1164.2691 1176.5599 1206.9875 1221.1868 1240.0874 1253.4062 1264.6615 1273.9053 1288.6251 1313.4570 1322.8307 1348.2230 1359.6881 1368.4289 1388.0456 1391.8880 1396.6341 1438.8204 1442.7863 1454.4201 1457.1950 1459.0617 1459.7948 1467.8515 1468.5790 1476.5320 1484.6066 1488.1723 1495.9072 1593.5809 1611.6630 2904.4254 2912.5987 2924.8680 2945.1945 2974.4024 2995.8650 2998.7412 3009.6666 3021.3006 3045.0962 3052.1288 3097.9420 3102.7432 3105.3820 3117.4898 3137.0933 3149.5114 3161.9272 3174.9053 3445.9835 3517.2349
redmass: 4.4251 3.4821 2.1808 4.3068 5.1174 2.9944 2.3943 3.1145 3.3860 2.7766 3.5757 1.3480 1.9568 1.8609 3.2627 4.1890 4.4725 3.9541 2.7914 2.7121 3.4893 1.3356 3.0956 3.1255 2.8927 4.4748 4.5699 4.3727 4.2143 4.8937 3.2748 4.5965 1.3472 3.6923 5.5311 1.2355 4.5256 1.1757 4.1801 1.3967 3.5349 4.3375 2.4839 2.2604 1.3656 1.6818 1.2922 5.7413 2.5177 2.3851 2.3067 3.5766 1.9178 2.5197 3.1471 2.1431 1.3369 1.8605 2.0701 2.1533 1.6012 1.0871 2.0588 1.4157 1.7613 1.3626 2.7465 1.2673 1.5374 1.1723 1.6208 1.2925 1.2110 1.3823 1.4189 1.4306 1.4598 5.2058 1.3989 1.1645 2.3302 1.1569 1.0515 1.1398 1.1343 1.0915 1.0892 2.4659 1.0706 1.0604 1.0852 7.6008 7.0786 1.0592 1.0699 1.0361 1.0668 1.0973 1.1026 1.0360 1.0775 1.0698 1.0940 1.0940 1.0995 1.0970 1.1005 1.1015 1.0851 1.0898 1.0948 1.1006 1.0742 1.0648
irintensity: 0.4701 0.9452 4.7379 0.3465 1.4954 0.2000 4.7520 1.9085 6.0289 2.7778 3.7970 0.9840 3.6786 4.7993 1.0091 5.5047 1.1682 1.7996 1.8956 0.7388 15.7375 124.2438 8.7037 8.5669 36.1763 8.7642 7.4767 30.0323 1.2797 1.6584 6.2092 11.7593 83.6866 7.4428 16.1347 106.2095 6.0952 2.3221 22.6837 0.2518 24.7241 32.7561 6.9262 46.2133 4.4833 1.2071 0.0073 32.3967 4.3099 7.6978 57.9634 18.1178 144.9938 23.8205 55.1651 19.3580 2.9987 24.7127 20.8550 21.1679 27.4074 5.0657 13.1773 28.4526 11.0705 34.3787 222.8493 4.9350 8.5141 5.1771 25.9462 33.5685 13.9877 6.9708 11.2386 26.3813 35.9650 9.4335 14.9623 1.5208 10.0057 13.7118 12.8797 51.6222 11.1715 7.1347 8.1906 177.7665 0.7685 6.4265 8.7659 27.5462 4.6512 67.1892 73.1292 95.8932 53.4771 70.8226 69.6631 12.3771 15.9366 27.6397 21.3793 41.8397 28.7877 34.7697 19.1422 14.8738 0.7937 12.2430 15.6053 15.1982 0.0592 6.5348
temp: 298.150 k
press: 1.00000 atm
elementType: 8 8 8 8 7 6 6 6 6 6 6 6 6 6 6 6 6 6 6 1 1 1 1 1 1 1 1 1 1 1 1 1 1 1 1 1 1 1 1 1
symmnumber: 1
zpe: 872346.7 jmol-1
zpe.correction: 0.332259 hartree
zpe.thermalcorrener: 0.352187 hartree
zpe.thermalcorrenthalpy: 0.353131 hartree
zpe.thermalcorrgfe: 0.281045 hartree
zpe.sumelectzpe: -900.202650 hartree
zpe.sumelectthermal: -900.182722 hartree
zpe.sumelectthermalent: -900.181778 hartree
zpe.sumelectthermalfe: -900.253864 hartree
dipole: 0.8884 -1.8356 0.6341
dipole: 2.1356
quadrupole: -114.7852 -113.7985 -111.7211
quadrupole: -0.4411 8.5674 2.5221
quadrupole: -1.3503 -0.3636 1.7139 -0.4411 8.5674 2.5221
hfenergy: -900.5349091 hartree
pointgroup: C01 [X(C14H21N1O4)]
dipole: 0.3444067 0.6979121 -0.3166519 debye
polarizability: 198.9744965|-27.8767647|168.9949775|5.0990757|13.4435306|145.4998442 unknown
InChI: InChI=1S/C14H21NO4/c1-14(16,10-15-7-8-17-2)13-9-18-11-5-3-4-6-12(11)19-13/h3-6,13,15-16H,7-10H2,1-2H3
charge 0 multiplicity 1
40 atoms
O  -1.059277 -0.164195 0.815003
O  -0.210049 -2.802528 1.405755
O  -2.562347 -0.746539 -1.611024
O  5.657104 1.230145 -0.239592
N  2.231415 -0.101704 0.353603
C  0.51542 -1.955482 0.434986
C  -0.48985 -1.01635 -0.276958
C  1.577033 -1.112176 1.211461
C  -1.640883 -1.731003 -0.995272
C  1.198277 -2.913933 -0.547049
C  -2.19987 0.588243 0.442315
C  -2.923418 0.308532 -0.748349
C  3.678168 0.121331 0.572614
C  -2.605495 1.640725 1.287243
C  4.247937 0.989166 -0.556707
C  -4.032621 1.104926 -1.099474
C  -3.725255 2.428009 0.940489
C  -4.432398 2.16561 -0.258499
C  6.330054 2.018093 -1.268498
H  0.049706 -0.359588 -0.985845
H  1.082016 -0.661169 2.098532
H  2.337877 -1.820013 1.586829
H  -1.279132 -2.334727 -1.840491
H  -2.197132 -2.37171 -0.286006
H  1.81754 -2.340163 -1.258065
H  0.470723 -3.530015 -1.101099
H  1.850406 -3.600051 0.020052
H  1.708651 0.784028 0.358514
H  -0.697847 -2.190718 2.019174
H  4.190427 -0.857586 0.560099
H  3.920465 0.606705 1.54648
H  -2.033573 1.831171 2.201246
H  3.698405 1.958005 -0.623368
H  4.141983 0.465472 -1.531556
H  -4.569679 0.87138 -2.024109
H  -4.038795 3.244029 1.599595
H  -5.296231 2.77901 -0.534678
H  6.320403 1.499835 -2.251568
H  7.371375 2.142823 -0.932263
H  5.860564 3.018311 -1.38952
