program: Gaussian 09
title: 000271849
version: EM64L-G09RevD.01
frameworkgroup: C1[X(C12H10FNO3)]
method: RPBEPBE
basis: SDD
operation: Freq
keyword: #p
keyword: freq=noraman
keyword: PBEPBE/SDD
title: #p freq=noraman PBEPBE/SDD
converged: YES YES NO NO
title: Mulliken charges:
elementType: F O O O N C C C C C C C C C C C C H H H H H H H H H H
charge: -0.189394 -0.252774 -0.174396 -0.167880 -0.073198 0.110491 -0.723570 -0.021318 0.194061 0.135401 0.298055 -0.777137 -0.315359 -0.296166 -0.356753 -0.358513 0.336911 0.253582 0.245791 0.240494 0.287056 0.245578 0.258205 0.289116 0.278453 0.267406 0.265859
chargesum: 0.00000
title: Mulliken charges with hydrogens summed into heavy atoms:
elementType: F O O O N C C C C C C C C C C C C
charge: -0.189394 -0.252774 -0.174396 -0.167880 -0.073198 0.110491 0.016297 -0.021318 0.194061 0.135401 0.298055 0.013702 -0.026242 -0.017713 -0.089348 -0.092654 0.336911
polarizability: 2.46308989e+02 1.16306825e+01 1.35002747e+02 5.20454613e+00 -9.04101190e+00 8.82274250e+01
1716.lowfreq: -1.9922 -0.0006 -0.0005 -0.0002 5.0284 10.3264 37.7969 48.2735 62.9447
frequency: 37.7816 48.2657 62.9417 88.8433 99.5903 149.2032 168.8692 180.7668 202.3494 231.4196 234.1486 273.0754 306.1965 323.8814 369.8946 384.4405 412.0714 413.5034 488.1178 506.7082 540.3668 575.2865 584.9722 621.4528 632.1001 660.8321 694.5049 721.6468 747.2988 786.1430 816.2327 827.4512 854.1855 870.8087 880.1608 955.1588 974.7750 980.7063 985.2121 1006.8233 1021.6201 1086.2308 1100.0367 1102.6814 1115.7085 1151.7767 1158.4449 1199.6811 1204.8418 1282.3175 1295.1572 1375.7593 1385.8340 1389.2378 1417.1214 1442.7944 1453.9778 1466.9306 1470.8970 1476.1295 1539.9976 1592.0756 1612.0372 1637.0536 1671.3764 2982.3815 3002.6061 3066.4832 3104.0798 3111.1291 3125.9570 3166.2783 3169.6283 3184.7919 3188.6382
redmass: 5.9875 4.9780 4.6267 8.8932 6.7564 5.0188 6.3575 1.1207 1.5079 3.1337 2.3818 3.9214 4.8920 8.3242 7.4216 5.0142 2.9791 5.2487 3.9730 3.4107 3.9294 5.3993 6.4491 6.6320 5.2215 5.0099 7.2470 6.7743 4.7385 6.7482 4.1108 1.2472 1.6285 3.1480 5.7110 2.2213 1.3658 6.0781 1.3569 2.6527 1.6990 3.5122 2.0870 1.8296 1.8981 4.4474 1.3973 3.5742 2.3469 4.5991 1.3368 1.2405 6.1142 1.1944 4.1599 1.0575 1.0660 1.1005 2.6844 1.0523 6.8870 8.0092 6.3588 9.2242 11.9973 1.0372 1.0350 1.0965 1.1015 1.1002 1.1000 1.0897 1.0891 1.0974 1.0983
irintensity: 1.4542 0.5531 3.6415 3.7718 1.3292 3.6813 0.9220 1.7808 0.0492 7.4951 1.0505 3.8087 1.2965 3.0376 0.6924 1.8044 0.1167 2.8955 17.1813 2.3793 1.9151 3.6793 44.6086 0.3567 16.1133 17.0534 4.8734 3.3624 13.1289 27.6600 33.2709 0.6469 72.8915 11.6882 2.6234 36.8935 0.4743 11.4012 0.3962 31.0863 7.3112 432.3004 6.5329 18.3291 46.1047 26.9258 86.5380 45.6348 20.0174 104.2297 21.7056 103.4410 29.4805 37.2831 31.7541 37.5840 24.3960 68.7129 399.2698 7.5382 351.7379 35.6196 283.0439 138.2776 61.4283 3.5238 12.1145 2.8128 12.5386 7.4813 6.2231 0.0712 0.7497 0.8870 3.8663
temp: 298.150 k
press: 1.00000 atm
elementType: 9 8 8 8 7 6 6 6 6 6 6 6 6 6 6 6 6 1 1 1 1 1 1 1 1 1 1
symmnumber: 1
zpe: 511103.8 jmol-1
zpe.correction: 0.194669 hartree
zpe.thermalcorrener: 0.210085 hartree
zpe.thermalcorrenthalpy: 0.211029 hartree
zpe.thermalcorrgfe: 0.151287 hartree
zpe.sumelectzpe: -842.319689 hartree
zpe.sumelectthermal: -842.304274 hartree
zpe.sumelectthermalent: -842.303330 hartree
zpe.sumelectthermalfe: -842.363071 hartree
dipole: 0.3605 -1.8408 2.8733
dipole: 3.4314
quadrupole: -91.5030 -104.1961 -97.9444
quadrupole: -9.9498 5.9433 -4.3454
quadrupole: 6.3782 -6.3149 -0.0632 -9.9498 5.9433 -4.3454
hfenergy: -842.5143585 hartree
pointgroup: C01 [X(C12H10F1N1O3)]
dipole: 0.1379104 0.6888133 -1.1528382 debye
polarizability: 245.9493694|-13.0138626|134.6754761|-6.4536106|-10.2417583|88.9143157 unknown
InChI: InChI=1S/C12H10FNO3/c1-7(15)12(2)11(16)14-10(17-12)8-3-5-9(13)6-4-8/h3-6H,1-2H3
charge 0 multiplicity 1
27 atoms
F  -5.51939 0.463757 0.169472
O  0.842865 0.60801 -0.650131
O  2.9984 -2.139315 0.21489
O  2.292816 1.739719 1.345273
N  0.678003 -1.527854 0.276178
C  2.250101 0.14379 -0.517757
C  2.937574 0.168454 -1.888105
C  2.064657 -1.328898 0.032641
C  2.954266 0.996312 0.584022
C  0.049967 -0.418291 -0.111977
C  -1.387547 -0.176431 -0.047843
C  4.453281 0.797432 0.697092
C  -2.242934 -1.217804 0.409433
C  -1.929485 1.082892 -0.426676
C  -3.631408 -1.008778 0.483652
C  -3.317413 1.30272 -0.355442
C  -4.13448 0.248983 0.097163
H  3.917766 -0.331786 -1.818835
H  2.327001 -0.378455 -2.626156
H  3.079654 1.202169 -2.246177
H  4.6986 -0.281408 0.691015
H  4.972683 1.257562 -0.164693
H  4.815769 1.266148 1.62443
H  -1.799111 -2.174317 0.700473
H  -1.257986 1.877731 -0.76232
H  -4.314648 -1.788577 0.830513
H  -3.7649 2.260236 -0.635133
