program: Gaussian 09
title: 000271903
version: EM64L-G09RevD.01
frameworkgroup: C1[X(C20H24Cl2O2)]
method: RPBEPBE
basis: SDD
operation: Freq
keyword: #p
keyword: freq=noraman
keyword: PBEPBE/SDD
title: #p freq=noraman PBEPBE/SDD
converged: NO YES NO NO
title: Mulliken charges:
elementType: Cl Cl O O C C C C C C C C C C C C C C C C C C C C H H H H H H H H H H H H H H H H H H H H H H H H
charge: 0.041666 -0.009640 -0.161669 -0.265430 -0.237239 -0.233566 -0.421186 -0.415264 0.549792 0.546600 -0.708916 -0.708739 -0.411960 -0.409566 -0.425630 -0.417714 -0.361471 -0.371862 -0.353602 -0.379244 0.358424 0.312267 -0.465087 -0.537614 0.209809 0.207939 0.217633 0.196792 0.196723 0.212632 0.209068 0.214846 0.234232 0.207864 0.211952 0.239737 0.238200 0.231811 0.230352 0.222941 0.256989 0.260984 0.248751 0.236388 0.317956 0.245623 0.218717 0.218711
chargesum: 0.00000
title: Mulliken charges with hydrogens summed into heavy atoms:
elementType: Cl Cl O O C C C C C C C C C C C C C C C C C C C C
charge: 0.041666 -0.009640 -0.161669 -0.265430 -0.027430 -0.025627 -0.006761 -0.005908 0.549792 0.546600 -0.050769 -0.049187 -0.173761 -0.177755 -0.195278 -0.194773 -0.104482 -0.110878 -0.104851 -0.142856 0.358424 0.312267 -0.147131 0.145437
polarizability: 2.72745164e+02 -1.55744305e+01 2.53515860e+02 -1.50167944e+01 -1.21618859e+01 2.04800516e+02
1716.lowfreq: -3.0831 0.0008 0.0009 0.0017 0.9196 6.5331 14.3290 21.0502 25.4623
frequency: 13.9056 20.8657 25.3321 40.2725 46.1301 61.3150 63.8778 71.0767 91.0167 101.2734 125.3238 139.9152 150.7834 161.8537 174.5476 186.3928 194.1983 229.4435 237.9263 243.1250 247.9861 273.5442 286.1074 292.1031 318.8547 341.4372 362.1765 402.1838 410.6308 414.5557 428.5516 467.5030 476.8931 489.5197 526.5485 537.3971 554.3132 577.6769 616.5612 629.9885 634.1678 696.7757 702.1502 730.8079 738.7368 754.4411 781.1943 795.2174 811.1860 817.5935 826.9770 835.8483 843.2725 849.1384 884.5751 924.3529 938.8952 949.5787 964.6816 966.5425 989.3568 996.4098 1002.5625 1006.5534 1027.8600 1043.2312 1058.7365 1076.3444 1085.3822 1093.8368 1094.5507 1112.0488 1114.8221 1128.2337 1156.1293 1160.7658 1179.1234 1185.4348 1194.0489 1202.1210 1206.3332 1224.7810 1229.1207 1246.8068 1247.7988 1277.8028 1295.2729 1301.1929 1306.2049 1326.0925 1326.6875 1331.1109 1342.6911 1384.2028 1386.3844 1390.3498 1390.3911 1413.6227 1416.9873 1435.8842 1465.9355 1467.7270 1473.1830 1473.9409 1475.6566 1476.6576 1486.2299 1487.2709 1492.7560 1500.7848 1583.5361 1593.9212 1615.6171 1621.7282 2953.0454 2955.3711 2964.7480 2972.7479 2976.1262 2976.7133 2978.5350 3031.7033 3039.7577 3041.4268 3066.9067 3067.7401 3083.1475 3085.9726 3099.7897 3113.7695 3122.9892 3125.3867 3127.2155 3138.0837 3154.4224 3158.9280 3166.1494 3172.2697
redmass: 7.3376 8.9615 5.5550 4.7394 3.3590 4.2466 6.1153 3.5820 4.0228 3.2983 2.1600 3.3466 2.7766 4.2838 2.1493 2.9158 3.6194 3.5006 1.7039 1.4324 1.6205 2.1500 5.0340 6.0908 5.1162 3.8153 5.2567 4.6855 2.9347 2.9425 4.7491 4.4530 3.5566 3.2483 4.2420 2.7374 3.9404 2.5904 7.2061 6.9585 6.7866 2.7188 2.9979 3.5029 3.6499 3.5966 2.6616 3.1697 1.4254 1.6087 1.3203 1.5545 1.7526 1.6684 1.9779 1.5700 1.4285 1.4377 1.3850 1.3682 8.3690 4.6427 2.7334 3.0133 1.8029 5.9378 1.7177 1.9086 1.8870 2.1682 2.3386 1.2602 1.4790 1.5045 1.3513 2.4927 1.2395 1.1096 1.2960 1.5866 2.1449 1.8559 3.4624 1.3422 1.3743 1.1657 1.3344 1.3078 1.1672 1.4686 1.5681 1.4195 1.3710 3.5469 3.9105 1.3220 1.2333 2.8137 3.0254 1.1753 1.0506 1.0729 1.0759 1.0601 1.0454 1.0416 1.0608 1.0700 2.4562 2.4248 6.9867 7.1463 6.5348 6.4131 1.0799 1.0334 1.0729 1.0655 1.0384 1.0368 1.0708 1.0982 1.0952 1.1038 1.0994 1.0994 1.0998 1.0996 1.0883 1.0881 1.0989 1.0894 1.0881 1.0895 1.0938 1.0951 1.0952 1.0959
irintensity: 0.1697 0.2095 0.0985 0.5022 0.9277 0.3057 1.3579 0.2442 0.5590 2.1884 0.2664 3.2007 1.3651 0.5038 0.2462 0.4651 0.9175 1.8059 0.3150 1.3330 0.7356 1.6648 0.9625 3.2109 5.6829 1.3518 3.8401 3.3374 0.2430 0.0111 6.7163 1.8748 3.5124 7.1607 6.4199 16.4983 21.2294 45.0553 153.2271 0.1037 2.3503 10.7141 21.8761 7.8926 14.5610 80.5349 2.4871 17.2346 39.4451 21.7414 3.5164 21.0167 52.1725 12.7233 15.8751 0.2499 0.3068 0.2742 0.1394 0.1351 40.8286 0.2938 13.2651 8.5991 8.2493 439.3497 33.2854 3.5563 0.5796 6.2926 9.7639 0.1637 8.0883 34.2761 1.6242 346.6464 51.2775 20.7814 55.7854 9.5636 31.7766 24.1890 164.4756 2.4626 0.9409 25.0134 0.6770 5.0021 0.0706 0.5681 14.9946 2.9807 5.7687 8.3343 6.0418 18.3617 1.7361 1.9241 0.2317 8.7720 12.8932 3.2654 55.6343 6.6106 10.5018 9.2962 7.4272 6.2354 124.9194 109.1041 5.2232 2.6627 14.3878 47.3322 3.0600 69.1876 13.3405 24.9053 77.7382 11.0028 36.3817 30.9047 28.2288 50.7213 45.0639 45.4842 50.3329 62.5962 11.4869 20.5307 24.0369 12.5934 13.1923 13.5842 14.9077 3.3154 4.8186 2.1883
temp: 298.150 k
press: 1.00000 atm
elementType: 17 17 8 8 6 6 6 6 6 6 6 6 6 6 6 6 6 6 6 6 6 6 6 6 1 1 1 1 1 1 1 1 1 1 1 1 1 1 1 1 1 1 1 1 1 1 1 1
symmnumber: 1
zpe: 1020740.0 jmol-1
zpe.correction: 0.388779 hartree
zpe.thermalcorrener: 0.414006 hartree
zpe.thermalcorrenthalpy: 0.414950 hartree
zpe.thermalcorrgfe: 0.330260 hartree
zpe.sumelectzpe: -1845.273247 hartree
zpe.sumelectthermal: -1845.248021 hartree
zpe.sumelectthermalent: -1845.247077 hartree
zpe.sumelectthermalfe: -1845.331767 hartree
dipole: 4.0746 -2.7610 -1.9928
dipole: 5.3100
quadrupole: -164.2251 -151.0304 -152.8564
quadrupole: 12.7594 -8.7828 -9.9163
quadrupole: -8.1878 5.0069 3.1809 12.7594 -8.7828 -9.9163
hfenergy: -1845.6620267 hartree
pointgroup: C01 [X(C20H24Cl2O2)]
dipole: 1.4001391 -1.2971744 -0.8493473 debye
polarizability: 266.235094|-18.4228499|257.483322|-19.8896582|-9.8860191|207.3431235 unknown
InChI: InChI=1S/C20H24Cl2O2/c1-4-18(14-6-10-16(23-3)11-7-14)19(5-2)15-8-12-17(13-9-15)24-20(21)22/h6-13,18-20H,4-5H2,1-3H3
charge 0 multiplicity 1
48 atoms
Cl -6.570688 1.846094 -0.335745
Cl -4.985588 1.617489 2.276343
O  -3.989826 1.315664 -0.280605
O  3.28089 3.706013 -0.23365
C  0.600188 -2.221345 -0.478715
C  1.662523 -1.789369 0.611106
C  0.207072 -3.724812 -0.392159
C  2.873991 -2.764071 0.695276
C  -0.62661 -1.307934 -0.403411
C  2.111699 -0.345106 0.365565
C  -0.824439 -4.155066 -1.458392
C  3.917777 -2.353382 1.75696
C  -0.869866 -0.32843 -1.399791
C  -1.541798 -1.39564 0.675439
C  1.758427 0.697545 1.261294
C  2.887925 -0.000054 -0.767749
C  -1.988168 0.526659 -1.336274
C  -2.668703 -0.548507 0.767074
C  2.156822 2.028965 1.038777
C  3.30201 1.329241 -1.012063
C  -2.882155 0.399394 -0.256121
C  2.932226 2.350651 -0.101897
C  -5.126512 1.012281 0.4640
C  4.078666 4.086574 -1.400165
H  1.074559 -2.066055 -1.470914
H  1.14992 -1.82111 1.596398
H  1.116469 -4.340682 -0.517297
H  -0.185647 -3.95217 0.620391
H  3.363057 -2.835868 -0.298184
H  2.508018 -3.779266 0.937462
H  -0.448727 -3.946438 -2.478351
H  -1.030023 -5.239226 -1.390994
H  -1.781995 -3.618439 -1.338751
H  3.455888 -2.286225 2.760557
H  4.735939 -3.095092 1.811852
H  4.361575 -1.369061 1.527213
H  -0.169161 -0.228637 -2.236257
H  -1.379181 -2.133152 1.470416
H  1.152967 0.463621 2.145429
H  3.189491 -0.779118 -1.479664
H  -2.179929 1.281777 -2.104025
H  -3.333434 -0.612994 1.634078
H  1.87888 2.831771 1.728479
H  3.904996 1.552484 -1.89775
H  -5.350456 -0.060396 0.548403
H  4.229106 5.171948 -1.30406
H  5.060519 3.573336 -1.403726
H  3.543805 3.867239 -2.345297
