program: Gaussian 09
title: 000271870
version: EM64L-G09RevD.01
frameworkgroup: C1[X(C16H14N2O6)]
method: RPBEPBE
basis: SDD
operation: Freq
keyword: #p
keyword: freq=noraman
keyword: PBEPBE/SDD
title: #p freq=noraman PBEPBE/SDD
converged: YES YES NO NO
title: Mulliken charges:
elementType: O O O O O O N N C C C C C C C C C C C C C C C C H H H H H H H H H H H H H H
charge: -0.286554 -0.234264 -0.187261 -0.181453 -0.182540 -0.183821 0.020762 0.022910 -0.553381 0.492704 -0.288912 -0.378177 -0.409580 0.433462 -0.354469 -0.417514 0.305621 0.217260 -0.487208 -0.465912 0.436346 0.433716 -0.489078 -0.804415 0.229797 0.218705 0.232868 0.254548 0.225165 0.229972 0.230012 0.231906 0.331010 0.328313 0.340478 0.224519 0.231069 0.233396
chargesum: 0.00000
title: Mulliken charges with hydrogens summed into heavy atoms:
elementType: O O O O O O N N C C C C C C C C C C C C C C C C
charge: -0.286554 -0.234264 -0.187261 -0.181453 -0.182540 -0.183821 0.020762 0.022910 -0.104879 0.492704 0.198504 -0.153012 -0.179609 0.433462 -0.124457 -0.185607 0.305621 0.217260 -0.156199 -0.137599 0.436346 0.433716 -0.148600 -0.115431
polarizability: 2.19120086e+02 -4.05313691e+00 2.29340659e+02 -4.36815040e+01 -7.94312599e+00 1.81078972e+02
1716.lowfreq: -10.1835 -7.5499 -4.6410 -3.1273 -0.0010 -0.0007 -0.0005 12.6978 19.2511
frequency: -7.7867 12.5197 19.1135 35.5134 38.8516 49.7394 51.9248 60.0544 75.7885 105.9130 133.4405 142.4361 166.4083 194.6991 205.1445 243.4004 280.3350 297.8297 318.0892 319.8802 342.3390 355.3876 375.7195 405.5953 415.3682 459.3044 465.2093 473.8226 490.4249 503.6357 549.5009 585.4120 634.4074 639.3237 683.5198 684.5906 697.6602 700.0466 723.8618 724.7327 738.1898 749.9975 794.3919 808.8375 817.4415 850.4659 867.5126 889.5974 939.0784 960.7138 972.9571 974.2431 976.4605 979.3584 987.7278 989.6890 991.7041 1014.6021 1048.3491 1052.6908 1069.6209 1089.6959 1113.3093 1127.2838 1193.3181 1194.8363 1205.8786 1207.8296 1215.4133 1223.9182 1231.2865 1233.4088 1257.2561 1310.0455 1332.3136 1353.1469 1378.1130 1379.7067 1383.2786 1398.4929 1406.6086 1408.0518 1435.3621 1455.7184 1460.5463 1468.1798 1470.3081 1475.6282 1510.7550 1586.3371 1588.5924 1617.3269 1627.1968 1632.8420 2977.4324 2984.8824 3024.2623 3051.9032 3055.9441 3085.1818 3099.5336 3109.3237 3114.7321 3133.2327 3140.7701 3180.3539 3192.3478 3201.6771
redmass: 7.5665 6.2003 3.6443 8.5435 1.0659 15.7442 15.6314 5.2173 5.3305 6.9054 5.2240 13.1508 5.4168 4.8901 4.7441 5.0241 3.3949 3.6090 5.5896 4.6743 8.7819 10.0001 2.2395 2.8616 4.1779 3.9066 5.6417 5.7668 5.1396 9.2268 2.5675 4.6406 6.3961 6.7321 11.5871 8.2643 2.8367 3.6355 3.0598 8.8279 6.4906 9.1332 3.4072 4.1054 1.6081 1.2539 11.0427 4.3478 1.8591 1.7205 1.3859 1.4394 1.9387 1.6042 5.5788 1.6892 1.4038 2.8341 1.5569 2.0169 1.5080 1.5926 4.3270 1.3429 1.1113 1.3580 7.5502 9.7184 2.8641 2.5826 1.2183 1.2138 5.5471 1.3224 1.4929 1.3604 4.1913 10.3757 10.2272 1.2740 5.5469 2.6582 5.7066 1.1086 3.2224 1.1917 1.0457 1.1026 2.7423 5.9697 8.1613 8.1889 6.5266 10.3242 1.0372 1.0624 1.0583 1.0978 1.0976 1.0988 1.1090 1.0871 1.0874 1.0962 1.0973 1.0927 1.0928 1.0927
irintensity: 0.0131 0.0654 0.0425 0.3216 0.4066 0.0047 0.0155 0.0141 0.4167 6.8127 4.2727 4.2803 2.1748 0.0390 0.0094 3.4743 3.9774 0.8382 0.5714 11.5980 0.3995 5.5696 0.0951 0.0893 2.5757 7.6789 0.1232 1.1475 4.1032 5.3997 27.3340 0.5762 2.9469 0.1182 37.4325 25.4494 44.8899 0.1718 0.9080 0.0335 11.4432 12.6195 16.2422 2.5770 34.7406 0.4401 14.4176 6.6765 21.0956 17.8224 0.0719 16.5445 19.2847 24.4497 2.7158 17.6232 4.4169 3.4360 10.0828 12.1316 121.6360 4.8821 276.0862 10.8358 2.1854 2.4611 208.0792 324.3638 27.3580 1.3188 8.5315 4.7902 80.5274 2.3466 1.7427 5.6006 3.0578 40.7238 145.6379 10.7870 8.2742 1.4272 17.7406 10.8673 41.1341 10.4841 13.2697 14.6147 28.6030 0.6374 3.4742 12.1287 6.7421 133.6974 33.0428 25.3807 40.5509 15.0731 20.5264 18.4074 20.9349 8.4080 16.4264 38.5641 2.9323 15.0216 24.8848 9.1381
temp: 298.150 k
press: 1.00000 atm
elementType: 8 8 8 8 8 8 7 7 6 6 6 6 6 6 6 6 6 6 6 6 6 6 6 6 1 1 1 1 1 1 1 1 1 1 1 1 1 1
symmnumber: 1
zpe: 726481.0 jmol-1
zpe.correction: 0.276702 hartree
zpe.thermalcorrener: 0.297895 hartree
zpe.thermalcorrenthalpy: 0.298839 hartree
zpe.thermalcorrgfe: 0.222240 hartree
zpe.sumelectzpe: -1177.072150 hartree
zpe.sumelectthermal: -1177.050957 hartree
zpe.sumelectthermalent: -1177.050013 hartree
zpe.sumelectthermalfe: -1177.126612 hartree
dipole: 5.0803 -1.4701 -1.3148
dipole: 5.4498
quadrupole: -149.7704 -153.2571 -135.2760
quadrupole: 3.7992 3.1880 15.3683
quadrupole: -3.6693 -7.1559 10.8252 3.7992 3.1880 15.3683
hfenergy: -1177.348852 hartree
pointgroup: C01 [X(C16H14N2O6)]
dipole: -1.8964186 0.9441631 0.3306187 debye
polarizability: 201.3010549|-47.2765702|198.6195983|-4.6128237|-9.1119565|229.6190638 unknown
InChI: InChI=1S/C16H14N2O6/c1-11-2-4-12(5-3-11)6-7-24-16(19)13-8-14(17(20)21)10-15(9-13)18(22)23/h2-5,8-10H,6-7H2,1H3
charge 0 multiplicity 1
38 atoms
O  -0.776544 1.877469 1.262854
O  -0.223838 2.404068 -0.952008
O  1.62715 -1.47438 3.770955
O  3.666802 -0.000151 -2.93155
O  3.414764 -2.560648 2.858477
O  4.792201 -1.569038 -1.71423
N  2.450048 -1.708857 2.80734
N  3.863462 -0.68818 -1.861036
C  -3.219996 1.9751 1.578223
C  -3.568879 0.937101 0.519711
C  -1.959966 2.792022 1.240143
C  -4.068251 1.330801 -0.749177
C  -3.383643 -0.444697 0.763767
C  -4.183118 -1.014853 -1.497381
C  -4.369465 0.372945 -1.738241
C  -3.687367 -1.405477 -0.229034
C  1.059723 0.731625 0.262566
C  -0.030304 1.751361 0.09931
C  1.923089 0.506532 -0.834875
C  1.229264 0.005926 1.463874
C  2.270786 -0.93893 1.542165
C  2.949312 -0.448049 -0.706063
C  3.150908 -1.189853 0.473118
C  -4.507453 -2.039752 -2.570759
H  -3.076623 1.490522 2.561178
H  -4.046297 2.704967 1.697405
H  -1.755163 3.555692 2.009818
H  -2.017975 3.262588 0.243681
H  -4.224418 2.39559 -0.965624
H  -3.003374 -0.77454 1.738636
H  -4.755414 0.702197 -2.711064
H  -3.53948 -2.470706 -0.013788
H  1.789037 1.06619 -1.765222
H  0.567427 0.171771 2.316339
H  3.95409 -1.926652 0.553494
H  -4.342595 -3.069543 -2.210278
H  -5.561326 -1.961006 -2.897333
H  -3.878273 -1.892753 -3.468886
