program: Gaussian 09
title: 000271848
version: EM64L-G09RevD.01
frameworkgroup: C1[X(C13H13NO4)]
method: RPBEPBE
basis: SDD
operation: Freq
keyword: #p
keyword: freq=noraman
keyword: PBEPBE/SDD
title: #p freq=noraman PBEPBE/SDD
converged: YES YES NO NO
title: Mulliken charges:
elementType: O O O O N C C C C C C C C C C C C C H H H H H H H H H H H H H
charge: -0.257100 -0.184152 -0.171939 -0.250972 -0.076581 0.113448 -0.725973 -0.026217 0.190795 0.123421 0.295204 -0.779477 -0.330243 -0.331965 -0.340624 -0.342418 0.333984 -0.536912 0.252522 0.244896 0.238132 0.288351 0.243167 0.255447 0.284776 0.270782 0.261147 0.248320 0.229677 0.252668 0.227835
chargesum: 0.00000
title: Mulliken charges with hydrogens summed into heavy atoms:
elementType: O O O O N C C C C C C C C C C C C C
charge: -0.257100 -0.184152 -0.171939 -0.250972 -0.076581 0.113448 0.009577 -0.026217 0.190795 0.123421 0.295204 0.007488 -0.045467 -0.061183 -0.079477 -0.094097 0.333984 0.173269
polarizability: 3.07490217e+02 1.64988871e+01 1.46258168e+02 5.08694889e+00 -7.90122836e+00 9.84632452e+01
1716.lowfreq: -0.0005 -0.0001 0.0007 2.7841 7.3100 9.7673 37.1660 43.8161 65.0526
frequency: 37.1377 43.8050 65.0436 76.3832 90.5551 117.6955 151.0162 173.6132 183.1762 201.4236 217.8557 224.9821 231.3124 233.4662 273.8690 309.7341 357.9281 374.7637 387.0244 416.2466 465.7924 495.6851 513.0622 542.7009 579.7880 588.2793 623.1952 633.7017 664.4911 695.4045 721.2289 754.3103 766.9862 814.1264 823.8797 855.3325 875.1601 877.7050 955.6122 972.3345 974.1085 983.7114 993.5751 1005.9167 1022.2314 1089.1461 1099.8823 1105.7121 1111.4406 1123.0523 1150.7346 1156.3842 1181.1054 1203.1467 1243.8778 1282.4497 1303.5758 1376.8158 1382.2022 1388.2920 1434.0018 1439.9480 1443.3845 1455.5636 1466.3172 1468.8293 1470.0440 1475.6410 1476.0769 1543.1933 1572.9383 1620.2639 1635.0003 1668.4569 2971.2456 2981.2569 3001.2210 3064.8168 3065.6439 3102.8457 3109.8117 3124.7456 3135.7978 3158.7825 3160.6873 3177.2841 3181.2277
redmass: 5.3107 4.3092 4.4960 5.0047 5.2006 4.8898 4.9196 4.4379 1.0892 1.5426 2.9573 1.5472 2.5548 1.9289 3.4460 4.3370 5.8278 5.4381 5.8062 2.9746 4.3453 3.9797 3.1684 3.8323 4.4905 6.5102 6.4459 5.2567 4.9076 7.2917 6.9634 4.5653 6.1225 4.1229 1.2971 1.6227 3.2458 5.0855 2.1860 1.3720 6.9696 7.4821 1.3479 2.6049 1.6946 3.5979 2.2327 1.9741 1.2591 1.7251 4.4536 1.3135 1.2416 3.5804 3.1118 5.4135 1.2939 1.2428 5.2475 1.1927 1.2504 3.6820 1.0616 1.0689 1.0794 1.2258 1.2069 1.3952 1.1623 6.3728 7.4381 6.3266 9.1346 11.6945 1.0325 1.0372 1.0350 1.1045 1.0965 1.1015 1.1002 1.1000 1.1003 1.0878 1.0888 1.0965 1.0980
irintensity: 1.9617 0.8691 3.9847 0.8831 0.3710 6.7811 2.9259 3.8212 1.4125 0.1551 2.2265 1.0427 5.7697 4.1645 7.7443 2.1787 1.4697 0.3926 1.8393 0.1255 6.2563 14.4189 3.9587 1.8273 3.1098 62.0306 3.4026 13.2616 16.5779 4.9196 3.5935 9.3773 11.9186 44.4898 9.0592 62.5169 8.6877 5.3853 35.3902 0.6188 31.6098 49.2214 0.2612 31.6772 7.9797 549.0602 7.6855 8.3951 0.2198 43.9802 21.5311 7.7573 206.8553 43.2637 189.1928 116.8764 20.2015 115.1688 14.2061 36.9006 112.3325 54.6783 37.8184 28.9479 69.2515 210.7441 183.5063 206.3886 45.8583 450.8933 38.5972 476.0529 136.1855 38.1061 69.7055 4.9185 14.2312 38.9396 3.4130 13.4397 8.8119 7.0062 21.3725 5.2360 0.3063 4.5762 6.4586
temp: 298.150 k
press: 1.00000 atm
elementType: 8 8 8 8 7 6 6 6 6 6 6 6 6 6 6 6 6 6 1 1 1 1 1 1 1 1 1 1 1 1 1
symmnumber: 1
zpe: 615886.6 jmol-1
zpe.correction: 0.234579 hartree
zpe.thermalcorrener: 0.251765 hartree
zpe.thermalcorrenthalpy: 0.252709 hartree
zpe.thermalcorrgfe: 0.189175 hartree
zpe.sumelectzpe: -857.504342 hartree
zpe.sumelectthermal: -857.487155 hartree
zpe.sumelectthermalent: -857.486211 hartree
zpe.sumelectthermalfe: -857.549746 hartree
dipole: -3.6641 -3.7322 3.1577
dipole: 6.1095
quadrupole: -76.0685 -111.3240 -106.3782
quadrupole: -0.3526 4.9549 -4.2532
quadrupole: 21.8550 -13.4004 -8.4546 -0.3526 4.9549 -4.2532
hfenergy: -857.7389206 hartree
pointgroup: C01 [X(C13H13N1O4)]
dipole: -1.4143791 1.4635129 -1.2787582 debye
polarizability: 306.6868274|-20.0629863|146.5592098|-5.3813812|-9.0600634|98.9655933 unknown
InChI: InChI=1S/C13H13NO4/c1-8(15)13(2)12(16)14-11(18-13)9-4-6-10(17-3)7-5-9/h4-7H,1-3H3
charge 0 multiplicity 1
31 atoms
O  1.182638 0.617405 -0.630469
O  3.483283 -2.027788 0.183596
O  2.598229 1.806353 1.363098
O  -5.195204 0.006144 0.217901
N  1.133551 -1.546604 0.247097
C  2.610286 0.22347 -0.511743
C  3.286658 0.296902 -1.88677
C  2.502874 -1.26845 0.01452
C  3.28256 1.093271 0.591825
C  0.44089 -0.463778 -0.117297
C  -1.000889 -0.302525 -0.050917
C  4.789409 0.952001 0.698427
C  -1.809125 -1.39735 0.378692
C  -1.616853 0.929902 -0.396552
C  -3.198812 -1.260161 0.453812
C  -3.013031 1.076796 -0.321194
C  -3.807854 -0.022514 0.104352
C  -5.893656 1.255814 -0.113433
H  4.290295 -0.156234 -1.83002
H  2.696966 -0.271127 -2.625905
H  3.375594 1.340161 -2.234674
H  5.074867 -0.116753 0.677341
H  5.287529 1.442682 -0.159128
H  5.136482 1.4230 1.630596
H  -1.318778 -2.337905 0.647164
H  -0.990372 1.769367 -0.71222
H  -3.839642 -2.084216 0.779737
H  -3.46946 2.034801 -0.585073
H  -5.569508 2.080131 0.549415
H  -6.95792 1.038577 0.054462
H  -5.729807 1.535228 -1.171342
