program: Gaussian 09
title: 000271845
version: EM64L-G09RevD.01
frameworkgroup: C1[X(C16H11NO3)]
method: RPBEPBE
basis: SDD
operation: Freq
keyword: #p
keyword: freq=noraman
keyword: PBEPBE/SDD
title: #p freq=noraman PBEPBE/SDD
converged: YES YES NO NO
title: Mulliken charges:
elementType: O O O N C C C C C C C C C C C C C C C C H H H H H H H H H H H
charge: -0.241511 -0.183165 -0.167561 -0.074406 -0.325857 0.137979 0.142348 0.010186 0.304918 0.288213 -0.324488 -0.353229 -0.343492 -0.327227 -0.256285 -0.227505 -0.219073 -0.220236 -0.217887 -0.217293 0.291673 0.271911 0.275330 0.282293 0.272704 0.236435 0.236295 0.238824 0.236941 0.236104 0.237062
chargesum: 0.00000
title: Mulliken charges with hydrogens summed into heavy atoms:
elementType: O O O N C C C C C C C C C C C C C C C C
charge: -0.241511 -0.183165 -0.167561 -0.074406 -0.034184 0.137979 0.142348 0.010186 0.304918 0.288213 -0.052577 -0.077899 -0.061199 -0.054523 -0.019849 0.008790 0.019751 0.016705 0.018217 0.019769
polarizability: 3.36330143e+02 2.16534472e+01 1.73014806e+02 1.03739633e+01 -1.83517112e+00 9.98631023e+01
1716.lowfreq: -9.3812 -3.6126 -2.3137 -0.0008 -0.0007 -0.0006 28.1199 35.8751 39.8603
frequency: 28.0555 35.8687 39.8484 57.2552 100.2290 114.8321 131.3212 144.1123 185.4982 207.3101 257.8312 321.3487 337.8800 388.1686 399.3381 401.3134 416.0303 447.0010 470.6630 504.2273 597.5501 611.4844 612.4965 643.0221 657.1614 673.1844 692.5731 695.5706 699.3103 711.2533 774.0463 794.5925 826.7022 846.8462 855.0903 863.7257 891.1719 926.0594 946.3058 957.3956 978.2457 986.7199 989.9355 992.8082 997.4365 1009.2939 1011.6840 1014.5900 1026.5317 1032.9694 1070.5616 1090.5937 1096.2370 1153.6598 1175.4677 1176.6445 1188.0443 1197.3235 1226.8117 1254.3130 1297.4631 1322.9235 1328.2131 1388.9745 1391.9236 1437.7048 1438.4082 1466.8486 1481.0738 1537.0929 1575.3330 1586.9864 1599.5629 1612.3059 1613.5716 1672.4815 3084.2677 3132.3967 3135.3090 3142.6670 3148.6614 3151.9185 3160.0853 3161.7207 3171.5116 3171.7473 3178.9274
redmass: 5.9684 6.0382 4.3011 5.0051 6.9902 6.8007 8.0503 5.7239 6.4344 6.8571 6.3186 9.0077 7.6395 7.4978 2.8087 2.8120 4.5397 4.1498 6.1845 5.5755 6.1920 6.4926 6.4444 8.0098 6.6048 5.9813 1.9858 1.9504 4.3193 4.7384 2.0909 2.0771 6.8400 6.4955 1.2611 1.2498 5.3872 4.9569 1.6498 1.4193 8.3610 2.2635 6.2743 2.2527 1.3905 1.3676 1.3457 4.4282 2.2092 2.1887 2.6588 1.5985 2.0534 1.5356 1.0647 1.0581 1.1141 1.1329 2.1156 3.2577 2.0308 1.3701 1.3126 8.7436 9.2378 2.2782 2.3136 2.4305 2.1694 7.6447 6.8183 6.2821 7.1487 6.5234 6.1642 12.1882 1.0856 1.0855 1.0860 1.0882 1.0893 1.0927 1.0938 1.0965 1.0968 1.1015 1.1001
irintensity: 1.6595 2.6005 0.8646 0.8824 0.1503 0.9244 0.8351 1.4984 5.7387 0.4312 3.5496 3.0245 0.1596 0.8358 0.5827 0.0447 5.0780 3.0930 0.7785 9.3422 4.6879 1.3044 0.1975 72.0337 5.1619 5.3583 44.4153 28.5267 28.6247 51.8011 56.3192 30.7011 9.0614 11.2534 2.2111 0.5689 10.2136 152.4744 50.1973 3.7605 24.4614 4.7636 0.6530 2.9193 0.1809 2.3100 0.1320 18.2905 43.1323 15.9237 307.1560 13.8934 151.6345 62.6933 1.9683 0.1958 36.9327 9.8281 115.8541 34.0823 161.7871 28.1559 6.0318 3.4282 6.3311 21.7458 76.0939 164.9859 4.2096 648.1794 79.6801 20.1587 70.3245 55.6515 101.8159 88.8352 3.6774 0.2350 0.2271 6.4762 11.0092 8.2330 15.8920 12.2940 11.9991 26.4328 16.0539
temp: 298.150 k
press: 1.00000 atm
elementType: 8 8 8 7 6 6 6 6 6 6 6 6 6 6 6 6 6 6 6 6 1 1 1 1 1 1 1 1 1 1 1
symmnumber: 1
zpe: 600068.5 jmol-1
zpe.correction: 0.228554 hartree
zpe.thermalcorrener: 0.244516 hartree
zpe.thermalcorrenthalpy: 0.245460 hartree
zpe.thermalcorrgfe: 0.182949 hartree
zpe.sumelectzpe: -895.341027 hartree
zpe.sumelectthermal: -895.325065 hartree
zpe.sumelectthermalent: -895.324121 hartree
zpe.sumelectthermalfe: -895.386632 hartree
dipole: -0.5522 -2.1310 2.6333
dipole: 3.4323
quadrupole: -70.2301 -120.9456 -116.7177
quadrupole: 0.5210 3.3311 2.1180
quadrupole: 32.4011 -18.3144 -14.0866 0.5210 3.3311 2.1180
hfenergy: -895.5695812 hartree
pointgroup: C01 [X(C16H11N1O3)]
dipole: -0.2132533 -1.0470228 0.8256685 debye
polarizability: 336.4229912|18.9811469|170.2477617|13.9571591|14.0649493|102.5372983 unknown
InChI: InChI=1S/C16H11NO3/c18-13(11-7-3-1-4-8-11)14-15(19)17-16(20-14)12-9-5-2-6-10-12/h1-10,14H
charge 0 multiplicity 1
31 atoms
O  -0.802065 -0.43005 0.780571
O  0.875665 -1.233941 -1.200522
O  0.99392 2.638227 0.243942
N  -1.203185 1.719804 -0.028742
C  0.524236 0.210786 0.727665
C  1.416079 -0.535385 -0.301891
C  -1.703178 0.520296 0.257383
C  0.182369 1.690333 0.291035
C  2.894301 -0.38444 -0.168788
C  -3.091359 0.096582 0.104327
C  3.492073 0.607303 0.656916
C  3.721898 -1.26732 -0.917514
C  -4.056946 1.046377 -0.330786
C  -3.476188 -1.244956 0.375718
C  4.897231 0.705097 0.733797
C  5.12306 -1.17306 -0.827608
C  -5.399575 0.653289 -0.488002
C  -4.82232 -1.628289 0.215117
C  5.714051 -0.187156 0.000956
C  -5.784404 -0.68248 -0.214888
H  0.964107 0.187406 1.73686
H  2.873359 1.33563 1.191152
H  3.24103 -2.013489 -1.55866
H  -3.732014 2.070924 -0.537046
H  -2.719449 -1.966512 0.697137
H  5.354947 1.480257 1.357221
H  5.756093 -1.860006 -1.399317
H  -6.145705 1.381143 -0.823071
H  -5.123372 -2.660968 0.419663
H  6.805066 -0.111701 0.069236
H  -6.829924 -0.985703 -0.339164
