program: Gaussian 09
title: 000271860
version: EM64L-G09RevD.01
frameworkgroup: C1[X(C21H22O5)]
method: RPBEPBE
basis: SDD
operation: Freq
keyword: #pfreq=noraman
keyword: PBEPBE/SDD
title: #p freq=noraman PBEPBE/SDD
converged: YES YES NO NO
title: Mulliken charges:
elementType: O O O O O C C C C C C C C C C C C C C C C C C C C C H H H H H H H H H H H H H H H H H H H H H H
charge: -0.253989 -0.231563 -0.418202 -0.230030 -0.206211 -0.353081 -0.379997 -0.375271 -0.517368 -0.485861 0.256766 0.172470 0.305443 -0.424825 0.363327 0.118701 0.339236 -0.352618 -0.364413 -0.407441 -0.393392 -0.388467 -0.388556 -0.235768 -0.234898 -0.236468 0.192104 0.188216 0.207299 0.230876 0.219526 0.220661 0.243757 0.253177 0.250570 0.253188 0.257501 0.254721 0.239850 0.276052 0.243020 0.244427 0.238454 0.240864 0.229235 0.230058 0.375354 0.233563
chargesum: 0.00000
title: Mulliken charges with hydrogens summed into heavy atoms:
elementType: O O O O O C C C C C C C C C C C C C C C C C C C C C
charge: -0.253989 -0.231563 -0.042848 -0.230030 -0.206211 0.027239 0.058178 0.064917 -0.020433 0.017896 0.256766 0.172470 0.305443 0.087397 0.363327 0.118701 0.339236 -0.112768 -0.088361 -0.164422 -0.148965 -0.150012 -0.147692 -0.006533 -0.004841 -0.002905
polarizability: 4.29954960e+02 -7.82435507e+00 1.98332551e+02 -3.11313681e+01 -1.31628883e+01 1.60123577e+02
1716.lowfreq: -3.7586 -0.0013 -0.0007 0.0008 2.0743 2.5282 9.8833 12.0884 12.3755
frequency: 7.9275 11.5096 12.2017 29.7669 40.3929 41.6557 52.7055 58.8052 68.4753 76.7847 76.9756 89.8611 122.7451 126.5205 135.2368 147.8589 159.6051 194.6704 226.0516 251.0787 286.3040 307.9121 318.4449 356.2952 382.9451 390.7484 402.7096 407.4519 455.3826 461.8053 489.0719 499.2022 507.4935 526.9648 558.1763 575.0603 587.1202 613.4481 633.5886 636.3234 638.5460 668.9932 700.4696 725.0815 731.4962 738.5414 751.3640 772.3437 792.7885 826.7464 832.3351 840.1650 849.8654 860.2879 862.5101 923.2639 937.7760 947.9552 963.3025 975.3554 986.1333 990.6956 995.2096 996.8739 998.9476 1006.2023 1016.2127 1033.8448 1041.1182 1044.9256 1060.5116 1081.4774 1087.0019 1092.8331 1099.7010 1114.8528 1124.8637 1139.8129 1175.4024 1192.1528 1202.2344 1219.5788 1226.0262 1241.0426 1243.3609 1253.6313 1268.8837 1289.3704 1291.4309 1291.9763 1303.0476 1306.6377 1315.1502 1331.0674 1346.4804 1360.5917 1369.6103 1374.8958 1377.6834 1419.6865 1420.4097 1437.6738 1438.6149 1440.6932 1465.4172 1472.5518 1476.7128 1485.8441 1514.0657 1554.0733 1585.8421 1598.1543 1612.3262 1622.4295 1658.9657 1670.2221 2952.2481 2982.7537 2985.4669 2991.6749 2997.5912 2997.8575 2998.7714 3030.6879 3040.4181 3060.0115 3068.6192 3088.8334 3125.7775 3129.6308 3134.4243 3138.9999 3143.2572 3151.5771 3155.9402 3162.9237 3167.6081 3511.8962
redmass: 7.7107 8.5139 7.2951 5.3973 4.1163 6.1251 1.8927 5.6577 4.0408 6.0874 3.6355 5.2775 2.3848 3.1097 2.4540 4.5450 5.9649 6.1390 7.0968 4.1544 4.7868 5.0445 6.0307 4.9429 4.2985 4.0896 2.8434 2.8514 5.0046 4.5935 4.4846 1.9585 3.0932 3.1442 3.1620 2.3849 4.6326 6.5260 6.9178 7.0238 1.3186 4.9818 1.7424 1.1186 4.6225 3.0630 1.3021 1.9547 5.7564 1.6986 2.1179 1.9885 1.2530 2.2871 2.0660 1.4450 1.5121 5.1759 1.4674 1.4524 2.7986 3.0108 4.7045 1.3271 2.3955 2.5868 2.8523 3.1093 1.9595 3.1987 2.9119 2.0555 1.6217 2.3019 2.8150 2.0255 1.3947 1.5948 1.0532 1.1174 1.1853 1.3575 1.3528 2.2022 1.1968 1.5192 1.2044 1.0696 2.5361 1.2194 1.4249 1.4194 1.4159 1.5044 1.6499 2.7428 1.7038 1.8138 9.4692 3.5038 1.1684 1.0846 2.3838 1.0829 1.0687 1.0895 2.1462 1.0978 2.7884 6.4109 6.2387 8.0114 6.1145 6.8581 9.7504 8.2545 1.0594 1.0646 1.0620 1.0656 1.0804 1.0617 1.0721 1.0979 1.0976 1.1017 1.1018 1.0997 1.0848 1.0875 1.0870 1.0885 1.0915 1.0964 1.0958 1.0968 1.1016 1.0639
irintensity: 0.1251 1.2444 1.0136 0.2177 1.4774 0.0566 0.2051 0.0781 0.5267 0.5568 0.7151 1.7553 0.4780 0.2383 1.2311 4.4837 3.6028 3.9448 1.2096 8.6110 0.5687 2.7422 24.8365 20.9476 6.0197 4.6570 0.5664 0.3614 9.4570 8.3575 5.1196 21.5192 22.6112 4.7532 6.3808 4.9050 16.0379 0.0915 0.2809 2.4754 128.9354 9.1668 46.9660 14.6400 16.9696 23.1578 0.1496 69.4260 4.9205 8.6117 34.9519 0.3092 0.5354 8.1523 10.2699 2.7386 8.3498 122.6099 8.5719 1.4082 9.8256 22.0173 38.7469 0.0726 53.5530 107.9329 53.9501 52.2183 7.2430 2.8798 42.6143 45.2146 8.8510 116.9956 63.7649 175.1468 10.2896 101.3242 0.0397 2.8388 74.8258 10.6876 71.9919 143.1009 40.8651 21.7555 3.0465 0.1077 4.1607 0.4046 4.4476 2.0458 0.1410 25.5449 108.6776 23.8748 13.4566 17.7027 0.7999 20.4279 41.2295 25.0398 7.8876 23.8643 0.0111 1.4485 7.9932 23.0864 4.2347 58.1578 35.0220 236.6335 3.6266 34.8515 123.7007 221.4740 25.5161 4.6063 5.3739 14.9432 19.8189 43.3907 45.9719 0.2176 1.4463 5.3039 87.9934 5.3822 8.0874 0.4589 14.5738 7.6806 6.2002 27.6808 24.3000 1.2738 29.9626 18.7418
temp: 298.150 k
press: 1.00000 atm
elementType: 8 8 8 8 8 6 6 6 6 6 6 6 6 6 6 6 6 6 6 6 6 6 6 6 6 6 1 1 1 1 1 1 1 1 1 1 1 1 1 1 1 1 1 1 1 1 1 1
symmnumber: 1
zpe: 1001565.0 jmol-1
zpe.correction: 0.381476 hartree
zpe.thermalcorrener: 0.406972 hartree
zpe.thermalcorrenthalpy: 0.407916 hartree
zpe.thermalcorrgfe: 0.318701 hartree
zpe.sumelectzpe: -1187.683431 hartree
zpe.sumelectthermal: -1187.657934 hartree
zpe.sumelectthermalent: -1187.656990 hartree
zpe.sumelectthermalfe: -1187.746206 hartree
dipole: -3.8878 -2.0575 -1.1719
dipole: 4.5521
quadrupole: -110.8143 -140.3360 -166.2457
quadrupole: -2.1023 -17.8400 -5.3085
quadrupole: 28.3177 -1.2040 -27.1137 -2.1023 -17.8400 -5.3085
hfenergy: -1188.0649065 hartree
pointgroup: C01 [X(C21H22O5)]
dipole: 1.5142398 0.0645637 0.9541545 debye
polarizability: 429.832679|-28.2714861|177.2763412|-15.9724846|-23.2556383|181.3020676 unknown
InChI: InChI=1S/C21H22O5/c22-19(15-26-21(25)10-6-2-5-9-20(23)24)18-13-11-17(12-14-18)16-7-3-1-4-8-16/h1,3-4,7-8,11-14,23H,2,5-6,9-10,15H2
charge 0 multiplicity 1
48 atoms
O  -1.561137 -0.136155 1.647868
O  -2.134556 -1.062986 -0.415639
O  -11.087641 0.769052 -0.903361
O  -9.971545 -1.127331 -1.642457
O  -0.03451 1.473973 0.071119
C  -6.266405 0.445424 0.243043
C  -4.945892 -0.330277 0.047676
C  -7.446634 -0.196016 -0.518743
C  -3.783121 0.291243 0.84744
C  -8.755625 0.593024 -0.328701
C  -2.451332 -0.379222 0.580733
C  -9.942831 -0.039363 -1.027796
C  2.050616 0.29494 0.382316
C  -0.175252 -0.55337 1.418395
C  4.869535 -0.000346 -0.04925
C  0.581754 0.495186 0.57566
C  6.333484 -0.156642 -0.275152
C  2.753253 -0.821913 0.91231
C  2.77698 1.260867 -0.366959
C  4.13606 -0.964844 0.697843
C  4.157537 1.116542 -0.576326
C  7.161466 -0.783573 0.697863
C  6.942387 0.31625 -1.471254
C  8.54767 -0.932204 0.483201
C  8.328206 0.166272 -1.687653
C  9.138672 -0.458548 -0.711349
H  -6.130009 1.493752 -0.096608
H  -6.510055 0.496822 1.325375
H  -5.084598 -1.384904 0.357317
H  -4.675386 -0.356543 -1.024485
H  -7.207493 -0.258789 -1.597653
H  -7.593413 -1.238624 -0.178123
H  -3.978489 0.275328 1.935217
H  -3.65817 1.359631 0.57551
H  -9.01106 0.683345 0.746355
H  -8.656913 1.632577 -0.69721
H  -0.152779 -1.529172 0.894675
H  0.269648 -0.653202 2.421981
H  2.225647 -1.59531 1.480907
H  2.22962 2.120863 -0.766909
H  4.650317 -1.851481 1.083624
H  4.701213 1.89043 -1.128659
H  6.724339 -1.126811 1.642414
H  6.323058 0.773235 -2.251135
H  9.167972 -1.408727 1.250335
H  8.77421 0.528065 -2.620647
H  -11.850321 0.324436 -1.364353
H  10.215018 -0.574505 -0.878859
