program: Gaussian 09
title: 000271858
version: EM64L-G09RevD.01
frameworkgroup: C1[X(C22H24O5)]
method: RPBEPBE
basis: SDD
operation: Freq
keyword: #pfreq=noraman
keyword: PBEPBE/SDD
title: #p freq=noraman PBEPBE/SDD
converged: YES YES NO NO
title: Mulliken charges:
elementType: O O O O O C C C C C C C C C C C C C C C C C C C C C C H H H H H H H H H H H H H H H H H H H H H H H H
charge: -0.253011 -0.233287 -0.417812 -0.231099 -0.205731 -0.369394 -0.367681 -0.378329 -0.374326 -0.519354 -0.487612 0.255328 0.171276 -0.425310 0.304994 0.363173 0.118931 0.338553 -0.352239 -0.364122 -0.407754 -0.394160 -0.390511 -0.388840 -0.234287 -0.235283 -0.236558 0.196658 0.193567 0.195428 0.191698 0.204598 0.227394 0.216812 0.218633 0.255423 0.244654 0.253364 0.252198 0.255328 0.256486 0.239606 0.276292 0.243035 0.245063 0.240781 0.239530 0.375131 0.229820 0.229437 0.233512
chargesum: 0.00000
title: Mulliken charges with hydrogens summed into heavy atoms:
elementType: O O O O O C C C C C C C C C C C C C C C C C C C C C C
charge: -0.253011 -0.233287 -0.042681 -0.231099 -0.205731 0.020830 0.019444 0.053663 0.061119 -0.019278 0.017950 0.255328 0.171276 0.086504 0.304994 0.363173 0.118931 0.338553 -0.112633 -0.087829 -0.164719 -0.149098 -0.149731 -0.149310 -0.004467 -0.005846 -0.003045
polarizability: 4.45504958e+02 3.00854392e+00 2.09438371e+02 -3.00332134e+01 -1.66828753e+01 1.67077263e+02
1716.lowfreq: -9.9942 -2.4122 -0.0015 -0.0010 0.0014 2.5994 7.2669 10.1193 16.1053
frequency: 6.0438 9.6403 15.3304 26.8984 35.7216 38.3291 41.3369 52.5694 66.4855 76.1863 80.4150 82.7495 89.3108 115.5950 126.1385 134.6313 139.7211 161.1865 195.6993 208.4832 225.4084 280.6909 291.3591 312.6386 336.5282 359.3463 383.4175 402.6627 406.8795 413.7367 461.6066 473.8610 489.0125 501.5378 505.7230 526.7668 554.1533 574.9565 589.6777 613.2770 633.1374 636.2074 638.4759 667.8072 701.0486 723.4979 730.7698 735.4073 739.3459 772.9035 784.5379 793.4363 832.1702 840.4160 850.7517 859.1140 862.9741 866.3445 923.7129 946.7272 963.3549 965.3029 975.9732 985.8762 988.5456 995.6525 997.2570 998.2181 1004.6938 1014.2266 1023.4098 1039.4261 1042.3307 1048.1424 1079.6110 1081.2752 1086.8550 1095.8165 1101.3739 1116.0776 1125.5847 1133.8959 1175.3176 1192.1366 1202.5388 1211.1651 1219.3426 1239.5785 1240.6196 1247.2453 1256.6756 1278.8640 1285.5869 1292.5410 1293.7392 1296.4188 1307.3126 1314.2134 1324.2580 1332.5549 1358.3217 1360.8355 1367.6586 1374.3227 1377.5498 1418.8216 1419.3585 1437.0870 1438.5451 1439.4720 1463.4754 1464.6914 1475.9459 1476.2303 1486.3191 1513.8520 1554.1644 1585.7954 1598.4520 1612.0741 1622.2079 1658.0847 1669.5318 2952.9849 2959.7421 2982.3537 2986.1219 2990.7540 2993.0189 2995.5956 2998.3206 3015.6401 3030.9505 3040.4142 3060.7952 3065.6755 3088.5822 3126.2355 3129.9017 3133.6981 3139.4568 3143.3041 3151.8733 3155.3930 3163.1728 3167.8654 3512.9780
redmass: 6.1313 6.9251 8.6400 5.3585 3.6452 5.0199 2.3965 6.4003 4.2148 3.9282 4.2345 3.3603 2.8177 4.8341 5.3821 2.3872 2.0114 5.5362 5.6594 4.3125 7.2987 5.4551 3.5137 6.9844 5.0733 4.9649 4.2646 2.8412 2.9407 4.0195 4.9394 4.0454 4.2655 1.7848 3.8223 3.1328 3.1345 2.3718 4.5849 6.5279 6.9177 7.0181 1.3129 5.0097 1.7544 1.0856 3.2985 1.4237 2.8187 1.9397 1.4589 4.5829 2.7996 1.9090 1.2516 4.2672 1.4006 1.4999 1.4476 5.7799 1.4962 1.3568 1.4652 2.2247 4.5050 5.7598 1.3326 2.8358 1.9653 3.1574 3.3219 2.2727 2.4223 3.2227 2.5262 2.0865 1.6207 2.6520 2.4127 1.7892 1.3995 1.7729 1.0534 1.1177 1.1929 1.4351 1.3168 1.1398 2.2601 1.5574 1.2624 1.1603 1.3074 2.8578 1.1248 1.1111 1.3861 1.4470 1.5140 1.5319 1.6436 2.7205 1.7474 1.8018 9.6010 1.3639 2.4251 1.0849 2.3721 1.0836 1.0654 1.0819 1.0952 2.1351 1.0997 2.7729 6.4205 6.2458 7.9610 6.0982 6.8527 9.7490 8.2269 1.0590 1.0593 1.0647 1.0612 1.0736 1.0837 1.0598 1.0608 1.1008 1.0992 1.0984 1.1026 1.1016 1.0998 1.0847 1.0875 1.0870 1.0884 1.0915 1.0964 1.0958 1.0967 1.1016 1.0639
irintensity: 0.4692 0.3599 0.9858 0.2516 0.5514 0.9796 0.4470 0.4163 0.5272 0.2813 1.6566 0.5399 2.0494 0.9924 0.7426 0.3079 0.1165 2.1249 2.9481 6.6824 1.4352 1.8710 19.7784 10.6464 2.9135 24.5548 3.0120 0.3411 0.2891 1.0952 11.9094 4.9131 5.4932 28.5276 17.8757 4.7733 3.3214 7.6253 15.4782 0.1120 0.3414 2.5286 128.9164 9.8436 45.9641 17.0683 9.5643 2.3469 26.6256 70.3120 5.8721 8.0688 30.5367 3.1977 0.5311 6.0799 16.4576 1.2388 3.3773 136.4230 14.4852 5.1311 1.3115 41.1298 6.2133 16.1658 0.8180 120.5942 21.9287 24.2283 4.4710 3.6502 27.3362 46.9186 60.7175 43.1725 8.3202 222.6614 5.9841 89.7543 10.7024 131.7798 0.0518 3.0646 82.8707 1.5799 85.0558 16.9136 165.2222 6.1565 1.6159 0.3397 0.3658 3.9658 0.1450 2.0919 2.6534 1.4238 34.4104 97.6602 0.0641 21.8963 7.8770 43.6724 0.7486 36.3587 26.1744 24.2545 9.2255 25.3685 0.1075 2.4589 0.0467 8.1337 26.1601 4.1795 58.9229 34.2300 234.6615 3.7755 33.7148 135.3051 209.4837 0.8045 45.4111 6.6313 6.2170 18.4418 7.0583 49.8916 46.7402 19.9991 0.8336 7.1191 15.1605 105.2194 4.9711 7.8238 0.7434 14.2097 7.9120 6.8908 25.8280 25.0218 1.7735 30.1377 18.3074
temp: 298.150 k
press: 1.00000 atm
elementType: 8 8 8 8 8 6 6 6 6 6 6 6 6 6 6 6 6 6 6 6 6 6 6 6 6 6 6 1 1 1 1 1 1 1 1 1 1 1 1 1 1 1 1 1 1 1 1 1 1 1 1
symmnumber: 1
zpe: 1074695.9 jmol-1
zpe.correction: 0.409330 hartree
zpe.thermalcorrener: 0.436252 hartree
zpe.thermalcorrenthalpy: 0.437197 hartree
zpe.thermalcorrgfe: 0.344088 hartree
zpe.sumelectzpe: -1226.906740 hartree
zpe.sumelectthermal: -1226.879817 hartree
zpe.sumelectthermalent: -1226.878873 hartree
zpe.sumelectthermalfe: -1226.971981 hartree
dipole: -4.1597 -2.2533 0.2525
dipole: 4.7375
quadrupole: -119.3269 -150.3918 -167.3474
quadrupole: -5.3373 7.8169 3.6697
quadrupole: 26.3618 -4.7031 -21.6587 -5.3373 7.8169 3.6697
hfenergy: -1227.3160697 hartree
pointgroup: C01 [X(C22H24O5)]
dipole: 1.629977 -0.8913745 -0.1506932 debye
polarizability: 445.7018024|-3.0504861|207.1146689|-28.9326229|19.5347935|169.2041203 unknown
InChI: InChI=1S/C22H24O5/c23-20(16-27-22(26)11-7-2-1-6-10-21(24)25)19-14-12-18(13-15-19)17-8-4-3-5-9-17/h3-5,8-9,12-15,24H,1-2,6-7,10-11,16H2
charge 0 multiplicity 1
51 atoms
O  -1.015554 -1.136369 1.460717
O  -1.587284 -0.971857 -0.795413
O  -11.755189 0.371697 -1.43856
O  -10.988855 1.094388 0.629754
O  0.426941 1.095369 0.867717
C  -5.755553 -0.099605 0.486361
C  -6.916905 -0.271751 -0.518037
C  -4.409758 -0.622002 -0.061312
C  -8.264212 0.249481 0.02745
C  -3.264617 -0.463875 0.958908
C  -9.409444 0.065358 -0.985949
C  -1.913639 -0.867901 0.406223
C  -10.746127 0.568075 -0.477913
C  0.380419 -1.334852 1.062084
C  2.553974 -0.005591 0.555474
C  5.368691 0.056773 0.013647
C  1.084377 0.018998 0.829865
C  6.830771 0.08706 -0.269014
C  3.301158 -1.211294 0.456217
C  3.233789 1.230772 0.378769
C  4.682157 -1.177549 0.190525
C  4.612149 1.260687 0.114168
C  7.645168 1.153195 0.20524
C  7.451073 -0.948805 -1.022305
C  9.03006 1.181588 -0.061861
C  8.835385 -0.920105 -1.291731
C  9.632761 0.145158 -0.812254
H  -5.655623 0.974081 0.74965
H  -6.006495 -0.629476 1.428991
H  -6.665439 0.259609 -1.459633
H  -7.013231 -1.345757 -0.782737
H  -4.510145 -1.6897 -0.340076
H  -4.143585 -0.084106 -0.990674
H  -8.518255 -0.275477 0.968295
H  -8.175355 1.320976 0.290416
H  -3.17438 0.596232 1.273145
H  -3.45755 -1.038032 1.883685
H  -9.189429 0.591313 -1.936005
H  -9.531589 -1.001076 -1.260701
H  0.846301 -1.885944 1.895528
H  0.43007 -1.937224 0.134013
H  2.814149 -2.18351 0.589063
H  2.648701 2.154183 0.443353
H  5.243798 -2.116897 0.148432
H  5.107381 2.22372 -0.050099
H  7.198359 1.947313 0.813911
H  6.841112 -1.763213 -1.429261
H  -12.618289 0.7120 -1.076375
H  9.640081 2.006806 0.321782
H  9.290281 -1.722424 -1.883093
H  10.707895 0.16776 -1.021078
