program: Gaussian 09
title: 000271829
version: EM64L-G09RevD.01
frameworkgroup: C1[X(C9H8Cl2O2)]
method: RPBEPBE
basis: SDD
operation: Freq
keyword: #p
keyword: freq=noraman
keyword: PBEPBE/SDD
title: #p freq=noraman PBEPBE/SDD
converged: YES YES NO NO
title: Mulliken charges:
elementType: Cl Cl O O C C C C C C C C C H H H H H H H H
charge: -0.050707 0.009877 -0.359612 -0.332004 0.063678 0.471120 0.256678 -0.348525 -0.806270 0.221692 -0.306998 -0.222732 -0.760290 0.239193 0.230204 0.264881 0.287319 0.270583 0.239420 0.242663 0.389829
chargesum: 0.00000
title: Mulliken charges with hydrogens summed into heavy atoms:
elementType: Cl Cl O O C C C C C C C C C
charge: -0.050707 0.009877 0.030217 -0.332004 0.063678 0.471120 0.256678 -0.348525 -0.071991 0.221692 -0.306998 0.064587 -0.007624
polarizability: 1.66283067e+02 1.83991074e+00 1.62362675e+02 -6.29466777e-01 9.15302932e-01 5.56658004e+01
1716.lowfreq: -3.4102 -0.0031 -0.0027 -0.0020 4.4760 9.1158 37.8520 72.7940 121.0965
frequency: 37.5326 72.7622 121.0879 128.7377 151.6742 180.6455 212.1938 264.1526 298.7676 316.8744 342.4522 350.5172 364.1638 373.8715 400.6657 442.7201 462.5589 585.7230 602.0229 613.5202 621.2583 686.7998 703.2701 751.6484 807.0295 884.4319 959.2787 987.0061 1017.2697 1026.8108 1038.4124 1047.1843 1076.1374 1190.2050 1226.3033 1275.0643 1313.7111 1353.3257 1379.5989 1396.4353 1404.1918 1417.9378 1442.6935 1458.7648 1481.2403 1496.3104 1543.1050 1564.8057 1605.7570 2505.1367 2997.6426 3003.5955 3087.8072 3096.6057 3120.6263 3129.9290 3182.1763
redmass: 3.1281 4.8016 4.8972 1.2695 7.1494 17.7148 7.7987 2.6746 1.3550 3.7173 10.2876 8.6679 5.7445 3.5374 6.2562 6.5270 4.0235 4.0321 3.4193 4.5952 5.2342 5.4919 8.1857 6.5041 6.5995 1.4120 2.6327 1.7989 1.6061 1.0910 1.5754 2.3061 3.9052 1.6329 4.1985 4.0572 5.4251 4.9040 1.2324 5.1730 1.3647 2.3805 1.1348 1.0561 1.1572 1.0729 3.9347 4.4682 3.2739 1.0758 1.0427 1.0384 1.0914 1.0938 1.0990 1.1007 1.0936
irintensity: 0.9685 2.1816 0.0656 0.0282 0.0087 0.2518 2.2807 2.1112 0.1017 6.6415 0.8495 0.1475 0.9458 0.0443 4.4198 3.2216 5.6613 14.5706 5.8855 12.4501 1.9157 32.0976 57.4817 4.7523 13.4253 15.5507 7.8129 9.4662 17.6024 125.6965 1.6972 12.0952 47.0810 22.7431 113.7790 59.6856 193.4697 53.3752 29.9977 6.8460 142.8071 322.3987 26.1751 6.0092 9.4767 37.6778 21.2940 1.9526 88.6502 380.2908 17.7054 4.5932 9.6944 13.4292 8.3175 5.8592 1.2277
temp: 298.150 k
press: 1.00000 atm
elementType: 17 17 8 8 6 6 6 6 6 6 6 6 6 1 1 1 1 1 1 1 1
symmnumber: 1
zpe: 386406.7 jmol-1
zpe.correction: 0.147175 hartree
zpe.thermalcorrener: 0.159791 hartree
zpe.thermalcorrenthalpy: 0.160735 hartree
zpe.thermalcorrgfe: 0.107372 hartree
zpe.sumelectzpe: -1417.378962 hartree
zpe.sumelectthermal: -1417.366346 hartree
zpe.sumelectthermalent: -1417.365402 hartree
zpe.sumelectthermalfe: -1417.418765 hartree
dipole: 3.2066 3.0610 0.1362
dipole: 4.4352
quadrupole: -81.4491 -101.5542 -90.1322
quadrupole: 2.2873 0.2939 -0.3815
quadrupole: 9.5961 -10.5091 0.9130 2.2873 0.2939 -0.3815
hfenergy: -1417.5261368 hartree
pointgroup: C01 [X(C9H8Cl2O2)]
dipole: -0.7635176 -1.5144432 0.4102839 debye
dipolederiv: -0.3175943 0.2918589 -0.0086449 0.3238335 -0.6036224 0.0342813 -0.0192768 0.02923 -0.0626102 -0.3171516 -0.3466743 0.0952058 -0.3220156 -0.49477 0.1180447 0.0878377 0.1230283 -0.0582643 -0.5893618 0.3851622 -0.0169998 0.2242228 -1.0551784 0.1005389 0.0019197 0.0693377 -0.3711471 -0.9199099 0.144727 0.0714548 0.5126567 -0.8098982 0.0411669 0.0037024 0.0895987 -0.3627671 -1.1137439 -0.0507009 0.1817298 0.1338492 -0.1861841 0.0147699 0.1534241 0.0327807 -0.1168937 0.4343734 0.3541689 -0.1066182 -0.1610823 0.0317599 0.0380315 -0.0108526 -0.050327 0.0376178 0.2854015 -0.7429238 0.1118234 -0.2676575 0.6914586 -0.0789366 -0.0072142 -0.001432 0.1457891 -0.0453549 -0.7186381 0.1025011 -0.6671729 0.7004806 -0.0326933 0.0861579 -0.0289913 -0.1279295 -0.0409594 -0.1161355 0.021293 0.0231009 -0.1414972 0.0227822 0.0317042 0.0747485 0.0451728 1.7174261 -0.0479972 -0.2923294 -0.3118205 0.7486335 -0.1253557 -0.2398905 -0.1466842 0.2375352 0.3969631 0.9275568 -0.2194365 0.5393411 0.5407819 -0.1770258 -0.1456174 -0.2310486 -0.0623287 -0.0574555 0.02307 0.0035062 0.1905024 -0.0441493 -0.0264884 -0.0123438 0.0044823 -0.0025526 -0.2692473 -0.1787997 0.0965681 -0.2746304 -0.2162546 0.1062984 0.074269 0.0687601 -0.0078175 0.0623846 -0.059935 0.0715344 -0.048555 0.0607853 -0.0081993 0.0892024 0.0263602 -0.0827391 -0.0595386 -0.0538684 -0.0951627 -0.0129191 0.070092 0.0422253 -0.1132212 -0.0009318 0.0434664 0.0748062 0.1217119 0.0364009 0.0246293 -0.0080009 -0.0200984 0.0204059 -0.046469 0.107686 0.0334484 -0.0032031 0.0168583 0.0097233 0.1149124 0.0047838 0.0126422 0.0099827 0.1566368 -0.0122994 0.0436615 0.0554238 0.1201788 0.0490624 -0.0339614 0.0621567 0.0037903 0.103846 0.0564841 0.0206523 -0.0873139 0.007812 0.0700475 0.0837199 -0.0415447 0.0872889 0.0114774 0.1133702 -0.0303427 0.0133553 -0.0474358 0.0416137 -0.0797076 -0.007023 -0.0830366 -0.0060783 0.5679587 0.0366493 -0.0511494 0.0034389 0.4399274 -0.0241761 -0.0264381 -0.0304679 0.3719007 unknown
polarizability: 162.222539|0.0555427|161.2389841|-16.3705481|-16.8335025|60.8500192 unknown
InChI: InChI=1S/C9H8Cl2O2/c1-4-6(10)3-7(11)9(13)8(4)5(2)12/h3,13H,1-2H3
charge 0 multiplicity 1
21 atoms
Cl 2.29871 -2.747147 0.150461
Cl 2.576519 2.675264 -0.706809
O  -0.360482 2.608784 -0.337363
O  -2.543501 1.657168 0.161962
C  -0.642298 0.191298 0.121295
C  -0.014732 -1.114388 0.206559
C  0.167854 1.364104 -0.191481
C  1.383236 -1.162397 0.03823
C  -0.780419 -2.406951 0.427335
C  -2.082382 0.460107 0.362143
C  1.575197 1.219148 -0.344942
C  2.185646 -0.027384 -0.224644
C  -3.096222 -0.54061 0.88169
H  -1.08492 -2.531243 1.482981
H  -1.686175 -2.461205 -0.195605
H  -0.1477 -3.270406 0.174389
H  3.266989 -0.129428 -0.344132
H  -3.985988 0.027313 1.193853
H  -2.716462 -1.129882 1.730867
H  -3.40135 -1.249104 0.090386
H  -1.402117 2.505258 -0.196676
